{"text_format":"3","workbook":"xlsx","n_sheets":39,"sheets":["Summary","Bat","Bowl","Pivots","Combined Data","Penn Street","White Waltham","Brightwell-Cum-Sotwell","Greys Green (1)","Crazies Hill & Cockpole Green","Britwell Salome","Harpsden (1)","Checkendon (1)","Cuxham","Privateers","Invalids","Stonor (1)","Theberton","Oporto (1)","Oporto (2)","Woodcote","Flycatchers","Ibstone","Crossbatters","Warborough","Ipsden","Henley","West Wycombe","Dorchester","Odney","Stonor (2)","VP Game","Medmenham","Wylde Oats","Middleton Stoney","Harpsden (2)","Checkendon (2)","Greys Green (2)","Historic Results"],"not_rendered":{"charts":7,"macros":1,"defined_names":4,"pivot_tables":7},"read":"whole","date_system":"1900"}

{"sheet":"Summary","index":0,"n_rows":37,"n_cols":30,"rows_kept":37,"merged":[[3,6,3,7],[3,9,3,10],[3,13,3,14],[3,18,3,19],[3,28,3,29],[10,28,10,29],[21,6,21,7],[21,9,21,10],[21,13,21,14],[21,18,21,19],[21,28,21,29],[26,28,26,29],[31,28,31,29],[34,13,34,14],[35,27,37,29]]}
[null,"Ctrl+Shft+S"]
[]
[]
[null,{"$f":"Pivots!A4","v":"Date"},{"$f":"Pivots!B4","v":"Opposition"},{"$f":"Pivots!C4","v":"Home/Away"},{"$f":"Pivots!D4","v":"Match Status"},null,"Overall Match Summary",null,null,"Home Fixtures",{"$nulls":3},"Top Run Scorers",{"$nulls":14},"Top Averages"]
[null,{"$f":"Pivots!A5","v":"2012-04-22"},{"$f":"Pivots!B5","v":"Penn Street"},{"$f":"Pivots!C5","v":"Away"},{"$f":"Pivots!D5","v":"Cancelled (Rain)"},null,{"$f":"Pivots!M4","v":"Win"},{"$f":"GETPIVOTDATA(\"Opposition\",Pivots!$M$3,\"Match Status\",G5)","v":12},null,{"$f":"Pivots!M15","v":"Win"},{"$f":"GETPIVOTDATA(\"Opposition\",Pivots!$M$14,\"Match Status\",J5)","v":6},null,null,{"$f":"VLOOKUP(O5,Bat!A:E,5,0)","v":"J. Hunt"},{"$f":"LARGE(Bat!A:A,1)","v":566},{"$nulls":13},{"$f":"VLOOKUP(AD5,Bat!B:E,4,0)","v":"J. Hancock"},{"$f":"LARGE(Bat!B:B,1)","v":63.5}]
[null,{"$f":"Pivots!A6","v":"2012-04-29"},{"$f":"Pivots!B6","v":"White Waltham"},{"$f":"Pivots!C6","v":"Home"},{"$f":"Pivots!D6","v":"Cancelled (Rain)"},null,{"$f":"Pivots!M5","v":"Loss"},{"$f":"GETPIVOTDATA(\"Opposition\",Pivots!$M$3,\"Match Status\",G6)","v":4},null,{"$f":"Pivots!M16","v":"Loss"},{"$f":"GETPIVOTDATA(\"Opposition\",Pivots!$M$14,\"Match Status\",J6)","v":1},null,null,{"$f":"VLOOKUP(O6,Bat!A:E,5,0)","v":"S. Beardall"},{"$f":"LARGE(Bat!A:A,2)","v":507},{"$nulls":13},{"$f":"VLOOKUP(AD6,Bat!B:E,4,0)","v":"O. Thornton"},{"$f":"LARGE(Bat!B:B,2)","v":{"v":55.25,"d":"55.3"}}]
[null,{"$f":"Pivots!A7","v":"2012-05-06"},{"$f":"Pivots!B7","v":"Brightwell-Cum-Sotwell"},{"$f":"Pivots!C7","v":"Away"},{"$f":"Pivots!D7","v":"Cancelled (Rain)"},null,{"$f":"Pivots!M6","v":"Draw"},{"$f":"GETPIVOTDATA(\"Opposition\",Pivots!$M$3,\"Match Status\",G7)","v":7},null,{"$f":"Pivots!M17","v":"Draw"},{"$f":"GETPIVOTDATA(\"Opposition\",Pivots!$M$14,\"Match Status\",J7)","v":7},null,null,{"$f":"VLOOKUP(O7,Bat!A:E,5,0)","v":"O. Thornton"},{"$f":"LARGE(Bat!A:A,3)","v":442},{"$nulls":13},{"$f":"VLOOKUP(AD7,Bat!B:E,4,0)","v":"J. Hunt"},{"$f":"LARGE(Bat!B:B,3)","v":{"v":51.45454545454545,"d":"51.5"}}]
[null,{"$f":"Pivots!A8","v":"2012-05-12"},{"$f":"Pivots!B8","v":"Greys Green (1)"},{"$f":"Pivots!C8","v":"Home"},{"$f":"Pivots!D8","v":"Cancelled (Rain)"},null,{"$f":"Pivots!M7","v":"Cancelled (Turville)"},{"$f":"GETPIVOTDATA(\"Opposition\",Pivots!$M$3,\"Match Status\",G8)","v":2},null,{"$f":"Pivots!M18","v":"Cancelled (Turville)"},{"$f":"GETPIVOTDATA(\"Opposition\",Pivots!$M$14,\"Match Status\",J8)","v":1},null,null,{"$f":"VLOOKUP(O8,Bat!A:E,5,0)","v":"J. Hancock"},{"$f":"LARGE(Bat!A:A,4)","v":381},{"$nulls":13},{"$f":"VLOOKUP(AD8,Bat!B:E,4,0)","v":"S. Beardall"},{"$f":"LARGE(Bat!B:B,4)","v":{"v":46.09090909090909,"d":"46.1"}}]
[null,{"$f":"Pivots!A9","v":"2012-05-19"},{"$f":"Pivots!B9","v":"Crazies Hill"},{"$f":"Pivots!C9","v":"Home"},{"$f":"Pivots!D9","v":"Win"},null,{"$f":"Pivots!M8","v":"Cancelled (Rain)"},{"$f":"GETPIVOTDATA(\"Opposition\",Pivots!$M$3,\"Match Status\",G9)","v":7},null,{"$f":"Pivots!M19","v":"Cancelled (Rain)"},{"$f":"GETPIVOTDATA(\"Opposition\",Pivots!$M$14,\"Match Status\",J9)","v":5},null,null,{"$f":"VLOOKUP(O9,Bat!A:E,5,0)","v":"C. Beardall"},{"$f":"LARGE(Bat!A:A,5)","v":295},{"$nulls":13},{"$f":"VLOOKUP(AD9,Bat!B:E,4,0)","v":"J. Thornton"},{"$f":"LARGE(Bat!B:B,5)","v":{"v":41,"d":"41.0"}}]
[null,{"$f":"Pivots!A10","v":"2012-05-20"},{"$f":"Pivots!B10","v":"Britwell Salome"},{"$f":"Pivots!C10","v":"Home"},{"$f":"Pivots!D10","v":"Draw"},null,{"$f":"Pivots!M9","v":"Cancelled (Opposition)"},{"$f":"GETPIVOTDATA(\"Opposition\",Pivots!$M$3,\"Match Status\",G10)","v":1},null,{"$f":"Pivots!M20","v":"Cancelled (Opposition)"},{"$f":"GETPIVOTDATA(\"Opposition\",Pivots!$M$14,\"Match Status\",J10)","v":1},null,null,{"$f":"VLOOKUP(O10,Bat!A:E,5,0)","v":"T. Wade"},{"$f":"LARGE(Bat!A:A,6)","v":191}]
[null,{"$f":"Pivots!A11","v":"2012-05-26"},{"$f":"Pivots!B11","v":"Harpsden (1)"},{"$f":"Pivots!C11","v":"Away"},{"$f":"Pivots!D11","v":"Loss"},null,{"$f":"Pivots!M10","v":"Grand Total"},{"$f":"SUM(H5:H10)","v":33},null,{"$f":"Pivots!M21","v":"Grand Total"},{"$f":"SUM(K5:K10)","v":21},null,null,{"$f":"VLOOKUP(O11,Bat!A:E,5,0)","v":"P. Briffett"},{"$f":"LARGE(Bat!A:A,7)","v":124},{"$nulls":13},"100s"]
[null,{"$f":"Pivots!A12","v":"2012-05-27"},{"$f":"Pivots!B12","v":"Checkendon (1)"},{"$f":"Pivots!C12","v":"Home"},{"$f":"Pivots!D12","v":"Win"},{"$nulls":8},{"$f":"VLOOKUP(O12,Bat!A:E,5,0)","v":"J. Thornton"},{"$f":"LARGE(Bat!A:A,8)","v":123},{"$nulls":13},{"$f":"VLOOKUP(AD12,Bat!C:E,3,0)","v":"O. Thornton"},{"$f":"LARGE(Bat!C:C,1)","v":2}]
[null,{"$f":"Pivots!A13","v":"2012-06-03"},{"$f":"Pivots!B13","v":"Cuxham"},{"$f":"Pivots!C13","v":"Home"},{"$f":"Pivots!D13","v":"Cancelled (Rain)"},{"$nulls":8},{"$f":"VLOOKUP(O13,Bat!A:E,5,0)","v":"J. Moberly"},{"$f":"LARGE(Bat!A:A,9)","v":121},{"$nulls":13},{"$f":"VLOOKUP(AD13,Bat!C:E,3,0)","v":"J. Hancock"},{"$f":"LARGE(Bat!C:C,2)","v":1}]
[null,{"$f":"Pivots!A14","v":"2012-06-09"},{"$f":"Pivots!B14","v":"Privateers"},{"$f":"Pivots!C14","v":"Home"},{"$f":"Pivots!D14","v":"Draw"},{"$nulls":8},{"$f":"VLOOKUP(O14,Bat!A:E,5,0)","v":"Ro. Dickie"},{"$f":"LARGE(Bat!A:A,10)","v":108}]
[null,{"$f":"Pivots!A15","v":"2012-06-16"},{"$f":"Pivots!B15","v":"Invalids"},{"$f":"Pivots!C15","v":"Home"},{"$f":"Pivots!D15","v":"Draw"},{"$nulls":8},"Other",{"$f":"SUM(Bat!A:A)-SUM(Summary!O5:O14)","v":799},{"$nulls":13},"Most 50s"]
[null,{"$f":"Pivots!A16","v":"2012-06-17"},{"$f":"Pivots!B16","v":"Stonor (1)"},{"$f":"Pivots!C16","v":"Away"},{"$f":"Pivots!D16","v":"Win"},{"$nulls":23},{"$f":"VLOOKUP(AD16,Bat!D:E,2,0)","v":"S. Beardall"},{"$f":"LARGE(Bat!D:D,1)","v":6}]
[null,{"$f":"Pivots!A17","v":"2012-06-24"},{"$f":"Pivots!B17","v":"Theberton"},{"$f":"Pivots!C17","v":"Home"},{"$f":"Pivots!D17","v":"Win"},{"$nulls":23},{"$f":"VLOOKUP(AD17,Bat!D:E,2,0)","v":"J. Hunt"},{"$f":"LARGE(Bat!D:D,2)","v":5}]
[null,{"$f":"Pivots!A18","v":"2012-06-30"},{"$f":"Pivots!B18","v":"Oporto"},{"$f":"Pivots!C18","v":"Tour"},{"$f":"Pivots!D18","v":"Win"},{"$nulls":23},{"$f":"VLOOKUP(AD18,Bat!D:E,2,0)","v":"O. Thornton"},{"$f":"LARGE(Bat!D:D,3)","v":3}]
[null,{"$f":"Pivots!A19","v":"2012-07-01"},{"$f":"Pivots!B19","v":"Oporto (2)"},{"$f":"Pivots!C19","v":"Tour"},{"$f":"Pivots!D19","v":"Win"},{"$nulls":23},"Other",{"$f":"SUM(Bat!D:D)-SUM(Summary!AD16:AD18)","v":6}]
[null,{"$f":"Pivots!A20","v":"2012-07-06"},{"$f":"Pivots!B20","v":"Woodcote"},{"$f":"Pivots!C20","v":"Away"},{"$f":"Pivots!D20","v":"Cancelled (Turville)"}]
[null,{"$f":"Pivots!A21","v":"2012-07-08"},{"$f":"Pivots!B21","v":"Flycatchers"},{"$f":"Pivots!C21","v":"Home"},{"$f":"Pivots!D21","v":"Cancelled (Rain)"}]
[null,{"$f":"Pivots!A22","v":"2012-07-15"},{"$f":"Pivots!B22","v":"Ibstone"},{"$f":"Pivots!C22","v":"Away"},{"$f":"Pivots!D22","v":"Win"},null,"Away Fixtures",null,null,"Tour Fixtures",{"$nulls":3},"Top Wicket Takers",{"$nulls":14},"Best Averages"]
[null,{"$f":"Pivots!A23","v":"2012-07-21"},{"$f":"Pivots!B23","v":"Crossbatters"},{"$f":"Pivots!C23","v":"Home"},{"$f":"Pivots!D23","v":"Loss"},null,{"$f":"Pivots!M26","v":"Win"},{"$f":"GETPIVOTDATA(\"Opposition\",Pivots!$M$25,\"Match Status\",G23)","v":4},null,{"$f":"Pivots!M37","v":"Win"},{"$f":"GETPIVOTDATA(\"Opposition\",Pivots!$M$36,\"Match Status\",J23)","v":2},null,null,"N. Runkel",{"$f":"LARGE(Bowl!A:A,1)","v":22},{"$nulls":13},{"$f":"VLOOKUP(AD23,Bowl!B:F,5,0)","v":"N. Runkel"},{"$f":"SMALL(Bowl!B:B,1)","v":{"v":11.045454545454545,"d":"11.0"}}]
[null,{"$f":"Pivots!A24","v":"2012-07-22"},{"$f":"Pivots!B24","v":"Warborough"},{"$f":"Pivots!C24","v":"Home"},{"$f":"Pivots!D24","v":"Draw"},null,{"$f":"Pivots!M27","v":"Loss"},{"$f":"GETPIVOTDATA(\"Opposition\",Pivots!$M$25,\"Match Status\",G24)","v":3},null,{"$f":"Pivots!M38","v":"Grand Total"},{"$f":"SUM(K23)","v":2},null,null,{"$f":"VLOOKUP(O24,Bowl!A:F,6,0)","v":"J. Hunt"},{"$f":"LARGE(Bowl!A:A,2)","v":22},{"$nulls":13},{"$f":"VLOOKUP(AD24,Bowl!B:F,5,0)","v":"J. Hunt"},{"$f":"SMALL(Bowl!B:B,2)","v":{"v":11.772727272727273,"d":"11.8"}}]
[null,{"$f":"Pivots!A25","v":"2012-07-29"},{"$f":"Pivots!B25","v":"Ipsden"},{"$f":"Pivots!C25","v":"Home"},{"$f":"Pivots!D25","v":"Win"},null,{"$f":"Pivots!M28","v":"Cancelled (Turville)"},{"$f":"GETPIVOTDATA(\"Opposition\",Pivots!$M$25,\"Match Status\",G25)","v":1},{"$nulls":5},"T. White",{"$f":"LARGE(Bowl!A:A,3)","v":15},{"$nulls":13},{"$f":"VLOOKUP(AD25,Bowl!B:F,5,0)","v":"J. Hancock"},{"$f":"SMALL(Bowl!B:B,3)","v":{"v":13.615384615384615,"d":"13.6"}}]
[null,{"$f":"Pivots!A26","v":"2012-08-05"},{"$f":"Pivots!B26","v":"Henley"},{"$f":"Pivots!C26","v":"Away"},{"$f":"Pivots!D26","v":"Win"},null,{"$f":"Pivots!M29","v":"Cancelled (Rain)"},{"$f":"GETPIVOTDATA(\"Opposition\",Pivots!$M$25,\"Match Status\",G26)","v":2},{"$nulls":5},{"$f":"VLOOKUP(O26,Bowl!A:F,6,0)","v":"N. Henry"},{"$f":"LARGE(Bowl!A:A,4)","v":15}]
[null,{"$f":"Pivots!A27","v":"2012-08-11"},{"$f":"Pivots!B27","v":"West Wycombe"},{"$f":"Pivots!C27","v":"Home"},{"$f":"Pivots!D27","v":"Cancelled (Opposition)"},null,{"$f":"Pivots!M30","v":"Grand Total"},{"$f":"SUM(H23:H26)","v":10},{"$nulls":5},{"$f":"VLOOKUP(O27,Bowl!A:F,6,0)","v":"J. Hancock"},{"$f":"LARGE(Bowl!A:A,5)","v":13},{"$nulls":13},"Best Economies"]
[null,{"$f":"Pivots!A28","v":"2012-08-12"},{"$f":"Pivots!B28","v":"Dorchester"},{"$f":"Pivots!C28","v":"Home"},{"$f":"Pivots!D28","v":"Win"},{"$nulls":8},{"$f":"VLOOKUP(O28,Bowl!A:F,6,0)","v":"J. Leefe"},{"$f":"LARGE(Bowl!A:A,6)","v":10},{"$nulls":13},{"$f":"VLOOKUP(AD28,Bowl!C:F,4,0)","v":"K. Haig"},{"$f":"SMALL(Bowl!C:C,1)","v":2.3}]
[null,{"$f":"Pivots!A29","v":"2012-08-19"},{"$f":"Pivots!B29","v":"Odney"},{"$f":"Pivots!C29","v":"Home"},{"$f":"Pivots!D29","v":"Draw"},{"$nulls":8},{"$f":"VLOOKUP(O29,Bowl!A:F,6,0)","v":"J. Thornton"},{"$f":"LARGE(Bowl!A:A,7)","v":9},{"$nulls":13},{"$f":"VLOOKUP(AD29,Bowl!C:F,4,0)","v":"A. Bignell"},{"$f":"SMALL(Bowl!C:C,2)","v":{"v":2.409090909090909,"d":"2.4"}}]
[null,{"$f":"Pivots!A30","v":"2012-08-25"},{"$f":"Pivots!B30","v":"Stonor (2)"},{"$f":"Pivots!C30","v":"Home"},{"$f":"Pivots!D30","v":"Cancelled (Rain)"},{"$nulls":8},{"$f":"VLOOKUP(O30,Bowl!A:F,6,0)","v":"S. Beardall"},{"$f":"LARGE(Bowl!A:A,8)","v":8},{"$nulls":13},{"$f":"VLOOKUP(AD30,Bowl!C:F,4,0)","v":"J. Hunt"},{"$f":"SMALL(Bowl!C:C,3)","v":{"v":2.5643564356435644,"d":"2.6"}}]
[null,{"$f":"Pivots!A31","v":"2012-09-01"},{"$f":"Pivots!B31","v":"VPs"},{"$f":"Pivots!C31","v":"Away"},{"$f":"Pivots!D31","v":"Loss"},{"$nulls":8},{"$f":"VLOOKUP(O31,Bowl!A:F,6,0)","v":"O. Thornton"},{"$f":"LARGE(Bowl!A:A,9)","v":6}]
[null,{"$f":"Pivots!A32","v":"2012-09-02"},{"$f":"Pivots!B32","v":"Medmenham"},{"$f":"Pivots!C32","v":"Home"},{"$f":"Pivots!D32","v":"Cancelled (Turville)"},{"$nulls":8},{"$f":"VLOOKUP(O32,Bowl!A:F,6,0)","v":"C. Beardall"},{"$f":"LARGE(Bowl!A:A,10)","v":4},{"$nulls":13},"Best Strike Rates"]
[null,{"$f":"Pivots!A33","v":"2012-09-08"},{"$f":"Pivots!B33","v":"Wylde Oats"},{"$f":"Pivots!C33","v":"Home"},{"$f":"Pivots!D33","v":"Draw"},{"$nulls":8},"Other",{"$f":"SUM(Bowl!G:G)-SUM(Summary!O23:O32)","v":47},{"$nulls":13},{"$f":"VLOOKUP(AD33,Bowl!D:F,3,0)","v":"N. Runkel"},{"$f":"SMALL(Bowl!D:D,1)","v":{"v":20.181818181818183,"d":"20.2"}}]
[null,{"$f":"Pivots!A34","v":"2012-09-09"},{"$f":"Pivots!B34","v":"Middleton Stoney"},{"$f":"Pivots!C34","v":"Home"},{"$f":"Pivots!D34","v":"Draw"},{"$nulls":23},{"$f":"VLOOKUP(AD34,Bowl!D:F,3,0)","v":"S. Beardall"},{"$f":"SMALL(Bowl!D:D,2)","v":22.5}]
[null,{"$f":"Pivots!A35","v":"2012-09-15"},{"$f":"Pivots!B35","v":"Harpsden (2)"},{"$f":"Pivots!C35","v":"Home"},{"$f":"Pivots!D35","v":"Win"},{"$nulls":8},"Most Maidens",{"$nulls":14},{"$f":"VLOOKUP(AD35,Bowl!D:F,3,0)","v":"J. Hunt"},{"$f":"SMALL(Bowl!D:D,3)","v":{"v":27.545454545454547,"d":"27.5"}}]
[null,{"$f":"Pivots!A36","v":"2012-09-22"},{"$f":"Pivots!B36","v":"Checkendon (2)"},{"$f":"Pivots!C36","v":"Away"},{"$f":"Pivots!D36","v":"Loss"},{"$nulls":8},{"$f":"VLOOKUP(O36,Bowl!E:F,2,0)","v":"T. White"},{"$f":"LARGE(Bowl!E:E,1)","v":21},{"$nulls":12},"Batting Avg. calculated for >99 runs\nBowling Avg. & SR calculated for > 4 wkts \nBowling Economy calculated for > 9 overs"]
[null,{"$f":"Pivots!A37","v":"2012-09-29"},{"$f":"Pivots!B37","v":"Greys Green (2)"},{"$f":"Pivots!C37","v":"Away"},{"$f":"Pivots!D37","v":"Win"},{"$nulls":8},{"$f":"VLOOKUP(O37,Bowl!E:F,2,0)","v":"J. Hunt"},{"$f":"LARGE(Bowl!E:E,2)","v":18}]

{"sheet":"Bat","index":1,"n_rows":210,"n_cols":9,"rows_kept":210}
["Ctrl+Shft+O"]
[]
["Runs","Average","100s","50s","Batsmen Name","Sum of Batsmen Runs","Sum of Batsmen Out","Sum of 50","Sum of 100"]
[{"$f":"F4","v":51},{"$f":"IF(F4>100,F4/G4,\"\")","v":""},{"$f":"I4","v":0},{"$f":"H4","v":0},"A. Bignell",51,1,0,0]
[22,"",0,0,"B. Bazell",22,2,0,0]
[1,"",0,0,"B. Bucknill",1,1,0,0]
[19,"",0,0,"B. Watson",19,1,0,0]
[295,32.77777777777778,0,2,"C. Beardall",295,9,2,0]
[10,"",0,0,"C. Henry",10,2,0,0]
[12,"",0,0,"C. Rogers",12,2,0,0]
[57,"",0,0,"C. Simon",57,5,0,0]
[0,"",0,0,"C. Wellbelove",0,1,0,0]
[1,"",0,0,"D. Bradman",1,1,0,0]
[0,"",0,0,"D. Mackey",0,1,0,0]
[49,"",0,0,"D. Stockings",49,2,0,0]
[34,"",0,0,"H. De Zulueta",34,2,0,0]
[0,"",0,0,"J. Crook",0,1,0,0]
[381,63.5,1,2,"J. Hancock",381,6,2,1]
[566,51.45454545454545,0,5,"J. Hunt",566,11,5,0]
[1,"",0,0,"J. Kleiner-Mann",1,1,0,0]
[51,"",0,0,"J. Leefe",51,3,0,0]
[0,"",0,0,"J. Reid",0,1,0,0]
[33,"",0,0,"J. Rogers",33,3,0,0]
[123,41,0,1,"J. Thornton",123,3,1,0]
[5,"",0,0,"M. Kemp",5,0,0,0]
[102,12.75,0,0,"N. Henry",102,8,0,0]
[1,"",0,0,"N. Phillips",1,1,0,0]
[7,"",0,0,"N. Runkel",7,1,0,0]
[3,"",0,0,"O. Brett",3,1,0,0]
[442,55.25,2,3,"O. Thornton",442,8,3,2]
[124,9.538461538461538,0,1,"P. Briffett",124,13,1,0]
[43,"",0,0,"P. De Zulueta",43,3,0,0]
[8,"",0,0,"P. Girdler",8,0,0,0]
[12,"",0,0,"P. Sheriff",12,1,0,0]
[0,"",0,0,"R. Beardall",0,1,0,0]
[6,"",0,0,"R. Dickie",6,1,0,0]
[29,"",0,0,"R. Gunn",29,2,0,0]
[15,"",0,0,"R. Hunt",15,1,0,0]
[4,"",0,0,"Ra. Dickie",4,1,0,0]
[108,10.8,0,0,"Ro. Dickie",108,10,0,0]
[507,46.09090909090909,0,6,"S. Beardall",507,11,6,0]
[52,"",0,0,"S. Bucknill",52,2,0,0]
[44,"",0,0,"S. Flakelar",44,1,0,0]
[75,"",0,0,"S. Halfhead",75,5,0,0]
[10,"",0,0,"T. Farley",10,1,0,0]
[3,"",0,0,"T. Greenwood",3,1,0,0]
[191,19.1,0,0,"T. Wade",191,10,0,0]
[20,"",0,0,"T. White",20,2,0,0]
[11,"",0,0,"V. Haig",11,1,0,0]
[8,"",0,0,"W. Strickland",8,2,0,0]
[121,10.083333333333334,0,0,"J. Moberly",121,12,0,0]
[0,"",0,0]
[0,"",0,0]
[0,"",0,0]
[0,"",0,0]
[0,"",0,0]
[0,"",0,0]
[0,"",0,0]
[0,"",0,0]
[0,"",0,0]
[0,"",0,0]
[0,"",0,0]
[0,"",0,0]
[0,"",0,0]
[0,"",0,0]
[0,"",0,0]
[0,"",0,0]
[{"$f":"F68","v":0},{"$f":"IF(F68>100,F68/G68,\"\")","v":""},{"$f":"I68","v":0},{"$f":"H68","v":0}]
[0,"",0,0]
[0,"",0,0]
[0,"",0,0]
[0,"",0,0]
[0,"",0,0]
[0,"",0,0]
[0,"",0,0]
[0,"",0,0]
[0,"",0,0]
[0,"",0,0]
[0,"",0,0]
[0,"",0,0]
[0,"",0,0]
[0,"",0,0]
[0,"",0,0]
[0,"",0,0]
[0,"",0,0]
[0,"",0,0]
[0,"",0,0]
[0,"",0,0]
[0,"",0,0]
[0,"",0,0]
[0,"",0,0]
[0,"",0,0]
[0,"",0,0]
[0,"",0,0]
[0,"",0,0]
[0,"",0,0]
[0,"",0,0]
[0,"",0,0]
[0,"",0,0]
[0,"",0,0]
[0,"",0,0]
[0,"",0,0]
[0,"",0,0]
[0,"",0,0]
[0,"",0,0]
[0,"",0,0]
[0,"",0,0]
[0,"",0,0]
[0,"",0,0]
[0,"",0,0]
[0,"",0,0]
[0,"",0,0]
[0,"",0,0]
[0,"",0,0]
[0,"",0,0]
[0,"",0,0]
[0,"",0,0]
[0,"",0,0]
[0,"",0,0]
[0,"",0,0]
[0,"",0,0]
[0,"",0,0]
[0,"",0,0]
[0,"",0,0]
[0,"",0,0]
[0,"",0,0]
[0,"",0,0]
[0,"",0,0]
[0,"",0,0]
[0,"",0,0]
[0,"",0,0]
[{"$f":"F132","v":0},{"$f":"IF(F132>100,F132/G132,\"\")","v":""},{"$f":"I132","v":0},{"$f":"H132","v":0}]
[0,"",0,0]
[0,"",0,0]
[0,"",0,0]
[0,"",0,0]
[0,"",0,0]
[0,"",0,0]
[0,"",0,0]
[0,"",0,0]
[0,"",0,0]
[0,"",0,0]
[0,"",0,0]
[0,"",0,0]
[0,"",0,0]
[0,"",0,0]
[0,"",0,0]
[0,"",0,0]
[0,"",0,0]
[0,"",0,0]
[0,"",0,0]
[0,"",0,0]
[0,"",0,0]
[0,"",0,0]
[0,"",0,0]
[0,"",0,0]
[0,"",0,0]
[0,"",0,0]
[0,"",0,0]
[0,"",0,0]
[0,"",0,0]
[0,"",0,0]
[0,"",0,0]
[0,"",0,0]
[0,"",0,0]
[0,"",0,0]
[0,"",0,0]
[0,"",0,0]
[0,"",0,0]
[0,"",0,0]
[0,"",0,0]
[0,"",0,0]
[0,"",0,0]
[0,"",0,0]
[0,"",0,0]
[0,"",0,0]
[0,"",0,0]
[0,"",0,0]
[0,"",0,0]
[0,"",0,0]
[0,"",0,0]
[0,"",0,0]
[0,"",0,0]
[0,"",0,0]
[0,"",0,0]
[0,"",0,0]
[0,"",0,0]
[0,"",0,0]
[0,"",0,0]
[0,"",0,0]
[0,"",0,0]
[0,"",0,0]
[0,"",0,0]
[0,"",0,0]
[0,"",0,0]
[{"$f":"F196","v":0},{"$f":"IF(F196>100,F196/G196,\"\")","v":""},{"$f":"I196","v":0},{"$f":"H196","v":0}]
[0,"",0,0]
[0,"",0,0]
[0,"",0,0]
[0,"",0,0]
[0,"",0,0]
[0,"",0,0]
[0,"",0,0]
[0,"",0,0]
[0,"",0,0]
[0,"",0,0]
[0,"",0,0]
[0,"",0,0]
[0,"",0,0]
[0,"",0,0]

{"sheet":"Bowl","index":2,"n_rows":180,"n_cols":10,"rows_kept":180}
["Ctrl+Shft+I",null,"Need to resolve macro issue with deleting run out - deletes row 31 instead"]
[]
["Wickets","Average","Economy","Strike Rate","Maidens","Bowler Name","Sum of Bowler Wickets","Sum of Bowler Overs","Sum of Bowler Maidens","Sum of Bowler Runs"]
[{"$f":"G4","v":2},{"$f":"IF(G4>4,J4/G4,\"\")","v":""},{"$f":"IF(H4>9,J4/H4,\"\")","v":2.409090909090909},{"$f":"IF(G4>4,(H4*6)/G4,\"\")","v":""},{"$f":"I4","v":8},"A. Bignell",2,22,8,53]
[{"$f":"G5","v":3},{"$f":"IF(G5>4,J5/G5,\"\")","v":""},{"$f":"IF(H5>9,J5/H5,\"\")","v":""},{"$f":"IF(G5>4,(H5*6)/G5,\"\")","v":""},{"$f":"I5","v":1},"B. Bucknill",3,5,1,20]
[1,"","","",2,"B. Watson",1,5,2,24]
[4,"",3.6666666666666665,"",2,"C. Beardall",4,12,2,44]
[3,"",4.6923076923076925,"",3,"C. Henry",3,39,3,183]
[0,"",4.7,"",3,"C. Rogers",0,10,3,47]
[2,"","","",0,"D. Bradman",2,4,0,8]
[2,"","","",0,"D. Stockings",2,6,0,52]
[3,"",5.875,"",0,"H. De Zulueta",3,16,0,94]
[1,"","","",0,"J. Crook",1,7,0,49]
[13,13.615384615384615,2.8548387096774195,28.615384615384617,13,"J. Hancock",13,62,13,177]
[22,11.772727272727273,2.5643564356435644,27.545454545454547,18,"J. Hunt",22,101,18,259]
[1,"","","",0,"J. Kleiner-Mann",1,3,0,6]
[10,20.6,3.6785714285714284,33.6,4,"J. Leefe",10,56,4,206]
[0,"","","",0,"J. Reid",0,2,0,19]
[4,"",3.6,"",3,"J. Rogers",4,20,3,72]
[9,18.555555555555557,3.7111111111111112,30,6,"J. Thornton",9,45,6,167]
[1,"",2.3,"",1,"K. Haig",1,10,1,23]
[1,"",5.166666666666667,"",1,"M. Kemp",1,12,1,62]
[15,40.8,4.340425531914893,56.4,17,"N. Henry",15,141,17,612]
[22,11.045454545454545,3.2837837837837838,20.181818181818183,9,"N. Runkel",22,74,9,243]
[1,"","","",0,"O. Brett",1,5,0,40]
[6,15.333333333333334,2.787878787878788,33,8,"O. Thornton",6,33,8,92]
[3,"",6.25,"",0,"P. Briffett",3,12,0,75]
[3,"",3.32,"",6,"P. Girdler",3,25,6,83]
[0,"","","",1,"Ra. Dickie",0,7,1,23]
[2,"","","",0,"Ro. Dickie",2,5,0,44]
[{"$nulls":5},"Run Out",6,0,0,0]
[8,15.875,4.233333333333333,22.5,4,"S. Beardall",8,30,4,127]
[1,"",3.857142857142857,"",0,"S. Flakelar",1,14,0,54]
[3,"",4.125,"",2,"S. Halfhead",3,16,2,66]
[1,"","","",0,"T. Farley",1,4,0,23]
[0,"","","",0,"T. Greenwood",0,1,0,5]
[15,16.133333333333333,2.880952380952381,33.6,21,"T. White",15,84,21,242]
[3,"",4.916666666666667,"",2,"J. Moberly",3,12,2,59]
[0,"","","",0]
[0,"","","",0]
[0,"","","",0]
[0,"","","",0]
[0,"","","",0]
[0,"","","",0]
[0,"","","",0]
[0,"","","",0]
[0,"","","",0]
[0,"","","",0]
[0,"","","",0]
[0,"","","",0]
[0,"","","",0]
[0,"","","",0]
[0,"","","",0]
[0,"","","",0]
[0,"","","",0]
[0,"","","",0]
[0,"","","",0]
[0,"","","",0]
[0,"","","",0]
[0,"","","",0]
[0,"","","",0]
[0,"","","",0]
[0,"","","",0]
[0,"","","",0]
[0,"","","",0]
[0,"","","",0]
[0,"","","",0]
[0,"","","",0]
[{"$f":"G69","v":0},{"$f":"IF(G69>4,J69/G69,\"\")","v":""},{"$f":"IF(H69>9,J69/H69,\"\")","v":""},{"$f":"IF(G69>4,(H69*6)/G69,\"\")","v":""},{"$f":"I69","v":0}]
[0,"","","",0]
[0,"","","",0]
[0,"","","",0]
[0,"","","",0]
[0,"","","",0]
[0,"","","",0]
[0,"","","",0]
[0,"","","",0]
[0,"","","",0]
[0,"","","",0]
[0,"","","",0]
[0,"","","",0]
[0,"","","",0]
[0,"","","",0]
[0,"","","",0]
[0,"","","",0]
[0,"","","",0]
[0,"","","",0]
[0,"","","",0]
[0,"","","",0]
[0,"","","",0]
[0,"","","",0]
[0,"","","",0]
[0,"","","",0]
[0,"","","",0]
[0,"","","",0]
[0,"","","",0]
[0,"","","",0]
[0,"","","",0]
[0,"","","",0]
[0,"","","",0]
[0,"","","",0]
[0,"","","",0]
[0,"","","",0]
[0,"","","",0]
[0,"","","",0]
[0,"","","",0]
[0,"","","",0]
[0,"","","",0]
[0,"","","",0]
[0,"","","",0]
[0,"","","",0]
[0,"","","",0]
[0,"","","",0]
[0,"","","",0]
[0,"","","",0]
[0,"","","",0]
[0,"","","",0]
[0,"","","",0]
[0,"","","",0]
[0,"","","",0]
[0,"","","",0]
[0,"","","",0]
[0,"","","",0]
[0,"","","",0]
[0,"","","",0]
[0,"","","",0]
[0,"","","",0]
[0,"","","",0]
[0,"","","",0]
[0,"","","",0]
[0,"","","",0]
[0,"","","",0]
[{"$f":"G133","v":0},{"$f":"IF(G133>4,J133/G133,\"\")","v":""},{"$f":"IF(H133>9,J133/H133,\"\")","v":""},{"$f":"IF(G133>4,(H133*6)/G133,\"\")","v":""},{"$f":"I133","v":0}]
[0,"","","",0]
[0,"","","",0]
[0,"","","",0]
[0,"","","",0]
[0,"","","",0]
[0,"","","",0]
[0,"","","",0]
[0,"","","",0]
[0,"","","",0]
[0,"","","",0]
[0,"","","",0]
[0,"","","",0]
[0,"","","",0]
[0,"","","",0]
[0,"","","",0]
[0,"","","",0]
[0,"","","",0]
[0,"","","",0]
[0,"","","",0]
[0,"","","",0]
[0,"","","",0]
[0,"","","",0]
[0,"","","",0]
[0,"","","",0]
[0,"","","",0]
[0,"","","",0]
[0,"","","",0]
[0,"","","",0]
[0,"","","",0]
[0,"","","",0]
[0,"","","",0]
[0,"","","",0]
[0,"","","",0]
[0,"","","",0]
[0,"","","",0]
[0,"","","",0]
[0,"","","",0]
[0,"","","",0]
[0,"","","",0]
[0,"","","",0]
[0,"","","",0]
[0,"","","",0]
[0,"","","",0]
[0,"","","",0]
[0,"","","",0]
[0,"","","",0]
[0,"","","",0]

{"sheet":"Pivots","index":3,"n_rows":96,"n_cols":14,"rows_kept":96}
["Ctrl+Shft+W",{"$nulls":11},"Ctrl+Shft+E"]
[]
[{"$nulls":12},"Row Labels","Count of Opposition"]
["Date","Opposition","Home/Away","Match Status",{"$nulls":8},"Win",12]
["2012-04-22","Penn Street","Away","Cancelled (Rain)",{"$nulls":8},"Loss",4]
["2012-04-29","White Waltham","Home","Cancelled (Rain)",{"$nulls":8},"Draw",7]
["2012-05-06","Brightwell-Cum-Sotwell","Away","Cancelled (Rain)",{"$nulls":8},"Cancelled (Turville)",2]
["2012-05-12","Greys Green (1)","Home","Cancelled (Rain)",{"$nulls":8},"Cancelled (Rain)",7]
["2012-05-19","Crazies Hill","Home","Win",{"$nulls":8},"Cancelled (Opposition)",1]
["2012-05-20","Britwell Salome","Home","Draw",{"$nulls":8},"Grand Total",33]
["2012-05-26","Harpsden (1)","Away","Loss"]
["2012-05-27","Checkendon (1)","Home","Win",{"$nulls":8},"Home/Away","Home"]
["2012-06-03","Cuxham","Home","Cancelled (Rain)"]
["2012-06-09","Privateers","Home","Draw",{"$nulls":8},"Row Labels","Count of Opposition"]
["2012-06-16","Invalids","Home","Draw",{"$nulls":8},"Win",6]
["2012-06-17","Stonor (1)","Away","Win",{"$nulls":8},"Loss",1]
["2012-06-24","Theberton","Home","Win",{"$nulls":8},"Draw",7]
["2012-06-30","Oporto","Tour","Win",{"$nulls":8},"Cancelled (Turville)",1]
["2012-07-01","Oporto (2)","Tour","Win",{"$nulls":8},"Cancelled (Rain)",5]
["2012-07-06","Woodcote","Away","Cancelled (Turville)",{"$nulls":8},"Cancelled (Opposition)",1]
["2012-07-08","Flycatchers","Home","Cancelled (Rain)",{"$nulls":8},"Grand Total",21]
["2012-07-15","Ibstone","Away","Win"]
["2012-07-21","Crossbatters","Home","Loss",{"$nulls":8},"Home/Away","Away"]
["2012-07-22","Warborough","Home","Draw"]
["2012-07-29","Ipsden","Home","Win",{"$nulls":8},"Row Labels","Count of Opposition"]
["2012-08-05","Henley","Away","Win",{"$nulls":8},"Win",4]
["2012-08-11","West Wycombe","Home","Cancelled (Opposition)",{"$nulls":8},"Loss",3]
["2012-08-12","Dorchester","Home","Win",{"$nulls":8},"Cancelled (Turville)",1]
["2012-08-19","Odney","Home","Draw",{"$nulls":8},"Cancelled (Rain)",2]
["2012-08-25","Stonor (2)","Home","Cancelled (Rain)",{"$nulls":8},"Grand Total",10]
["2012-09-01","VPs","Away","Loss"]
["2012-09-02","Medmenham","Home","Cancelled (Turville)"]
["2012-09-08","Wylde Oats","Home","Draw"]
["2012-09-09","Middleton Stoney","Home","Draw",{"$nulls":8},"Home/Away","Tour"]
["2012-09-15","Harpsden (2)","Home","Win"]
["2012-09-22","Checkendon (2)","Away","Loss",{"$nulls":8},"Row Labels","Count of Opposition"]
["2012-09-29","Greys Green (2)","Away","Win",{"$nulls":8},"Win",2]
["Grand Total",{"$nulls":11},"Grand Total",2]
[]
[]
[]
["Ctrl+Shft+R"]
[]
[]
[]
[null,"Values",{"$nulls":6},"Values"]
["Batsmen Name","Sum of Batsmen Runs","Sum of Batsmen Out","Sum of 50","Sum of 100",null,null,"Bowler Name","Sum of Bowler Wickets","Sum of Bowler Overs","Sum of Bowler Maidens","Sum of Bowler Runs"]
["A. Bignell",51,1,0,0,null,null,"A. Bignell",2,22,8,53]
["B. Bazell",22,2,0,0,null,null,"B. Bucknill",3,5,1,20]
["B. Bucknill",1,1,0,0,null,null,"B. Watson",1,5,2,24]
["B. Watson",19,1,0,0,null,null,"C. Beardall",4,12,2,44]
["C. Beardall",295,9,2,0,null,null,"C. Henry",3,39,3,183]
["C. Henry",10,2,0,0,null,null,"C. Rogers",0,10,3,47]
["C. Rogers",12,2,0,0,null,null,"D. Bradman",2,4,0,8]
["C. Simon",57,5,0,0,null,null,"D. Stockings",2,6,0,52]
["C. Wellbelove",0,1,0,0,null,null,"H. De Zulueta",3,16,0,94]
["D. Bradman",1,1,0,0,null,null,"J. Crook",1,7,0,49]
["D. Mackey",0,1,0,0,null,null,"J. Hancock",13,62,13,177]
["D. Stockings",49,2,0,0,null,null,"J. Hunt",22,101,18,259]
["H. De Zulueta",34,2,0,0,null,null,"J. Kleiner-Mann",1,3,0,6]
["J. Crook",0,1,0,0,null,null,"J. Leefe",10,56,4,206]
["J. Hancock",381,6,2,1,null,null,"J. Reid",0,2,0,19]
["J. Hunt",566,11,5,0,null,null,"J. Rogers",4,20,3,72]
["J. Kleiner-Mann",1,1,0,0,null,null,"J. Thornton",9,45,6,167]
["J. Leefe",51,3,0,0,null,null,"K. Haig",1,10,1,23]
["J. Reid",0,1,0,0,null,null,"M. Kemp",1,12,1,62]
["J. Rogers",33,3,0,0,null,null,"N. Henry",15,141,17,612]
["J. Thornton",123,3,1,0,null,null,"N. Runkel",22,74,9,243]
["M. Kemp",5,0,0,0,null,null,"O. Brett",1,5,0,40]
["N. Henry",102,8,0,0,null,null,"O. Thornton",6,33,8,92]
["N. Phillips",1,1,0,0,null,null,"P. Briffett",3,12,0,75]
["N. Runkel",7,1,0,0,null,null,"P. Girdler",3,25,6,83]
["O. Brett",3,1,0,0,null,null,"Ra. Dickie",0,7,1,23]
["O. Thornton",442,8,3,2,null,null,"Ro. Dickie",2,5,0,44]
["P. Briffett",124,13,1,0,null,null,"Run Out",6,0,0,0]
["P. De Zulueta",43,3,0,0,null,null,"S. Beardall",8,30,4,127]
["P. Girdler",8,0,0,0,null,null,"S. Flakelar",1,14,0,54]
["P. Sheriff",12,1,0,0,null,null,"S. Halfhead",3,16,2,66]
["R. Beardall",0,1,0,0,null,null,"T. Farley",1,4,0,23]
["R. Dickie",6,1,0,0,null,null,"T. Greenwood",0,1,0,5]
["R. Gunn",29,2,0,0,null,null,"T. White",15,84,21,242]
["R. Hunt",15,1,0,0,null,null,"J. Moberly",3,12,2,59]
["Ra. Dickie",4,1,0,0,null,null,"Grand Total",171,900,135,3353]
["Ro. Dickie",108,10,0,0]
["S. Beardall",507,11,6,0]
["S. Bucknill",52,2,0,0]
["S. Flakelar",44,1,0,0]
["S. Halfhead",75,5,0,0]
["T. Farley",10,1,0,0]
["T. Greenwood",3,1,0,0]
["T. Wade",191,10,0,0]
["T. White",20,2,0,0]
["V. Haig",11,1,0,0]
["W. Strickland",8,2,0,0]
["J. Moberly",121,12,0,0]
["Grand Total",3657,159,20,3]

{"sheet":"Combined Data","index":4,"n_rows":367,"n_cols":26,"rows_kept":367}
["Ctrl+q"]
[]
[]
["Date","Opposition","Match Status","Home/Away","Captain","TPCC Batting First","TPCC Team Score","TPCC Team Wickets","Opposition Team Score","Opposition Team Wickets","TPCC Overs Bowled","TPCC Overs Faced","Batting Extras","Bowling Extras","Batsmen Position","Batsmen Name","Batsmen Runs","Batsmen Out",50,100,"Bowler Position","Bowler Name","Bowler Overs","Bowler Maidens","Bowler Wickets","Bowler Runs"]
[41021,"Penn Street","Cancelled (Rain)","Away",0,0,0,0,0,0,0,0,0,0,1,0,0,0,0,0,1,0,0,0,0,0]
[41021,"Penn Street","Cancelled (Rain)","Away",0,0,0,0,0,0,0,0,0,0,2,0,0,0,0,0,2,0,0,0,0,0]
[41021,"Penn Street","Cancelled (Rain)","Away",0,0,0,0,0,0,0,0,0,0,3,0,0,0,0,0,3,0,0,0,0,0]
[41021,"Penn Street","Cancelled (Rain)","Away",0,0,0,0,0,0,0,0,0,0,4,0,0,0,0,0,4,0,0,0,0,0]
[41021,"Penn Street","Cancelled (Rain)","Away",0,0,0,0,0,0,0,0,0,0,5,0,0,0,0,0,5,0,0,0,0,0]
[41021,"Penn Street","Cancelled (Rain)","Away",0,0,0,0,0,0,0,0,0,0,6,0,0,0,0,0,6,0,0,0,0,0]
[41021,"Penn Street","Cancelled (Rain)","Away",0,0,0,0,0,0,0,0,0,0,7,0,0,0,0,0,7,0,0,0,0,0]
[41021,"Penn Street","Cancelled (Rain)","Away",0,0,0,0,0,0,0,0,0,0,8,0,0,0,0,0,8,0,0,0,0,0]
[41021,"Penn Street","Cancelled (Rain)","Away",0,0,0,0,0,0,0,0,0,0,9,0,0,0,0,0,9,0,0,0,0,0]
[41021,"Penn Street","Cancelled (Rain)","Away",0,0,0,0,0,0,0,0,0,0,10,0,0,0,0,0,10,0,0,0,0,0]
[41021,"Penn Street","Cancelled (Rain)","Away",0,0,0,0,0,0,0,0,0,0,11,0,0,0,0,0,11,0,0,0,0,0]
[41028,"White Waltham","Cancelled (Rain)","Home",0,0,0,0,0,0,0,0,0,0,1,0,0,0,0,0,1,0,0,0,0,0]
[41028,"White Waltham","Cancelled (Rain)","Home",0,0,0,0,0,0,0,0,0,0,2,0,0,0,0,0,2,0,0,0,0,0]
[41028,"White Waltham","Cancelled (Rain)","Home",0,0,0,0,0,0,0,0,0,0,3,0,0,0,0,0,3,0,0,0,0,0]
[41028,"White Waltham","Cancelled (Rain)","Home",0,0,0,0,0,0,0,0,0,0,4,0,0,0,0,0,4,0,0,0,0,0]
[41028,"White Waltham","Cancelled (Rain)","Home",0,0,0,0,0,0,0,0,0,0,5,0,0,0,0,0,5,0,0,0,0,0]
[41028,"White Waltham","Cancelled (Rain)","Home",0,0,0,0,0,0,0,0,0,0,6,0,0,0,0,0,6,0,0,0,0,0]
[41028,"White Waltham","Cancelled (Rain)","Home",0,0,0,0,0,0,0,0,0,0,7,0,0,0,0,0,7,0,0,0,0,0]
[41028,"White Waltham","Cancelled (Rain)","Home",0,0,0,0,0,0,0,0,0,0,8,0,0,0,0,0,8,0,0,0,0,0]
[41028,"White Waltham","Cancelled (Rain)","Home",0,0,0,0,0,0,0,0,0,0,9,0,0,0,0,0,9,0,0,0,0,0]
[41028,"White Waltham","Cancelled (Rain)","Home",0,0,0,0,0,0,0,0,0,0,10,0,0,0,0,0,10,0,0,0,0,0]
[41028,"White Waltham","Cancelled (Rain)","Home",0,0,0,0,0,0,0,0,0,0,11,0,0,0,0,0,11,0,0,0,0,0]
[41035,"Brightwell-Cum-Sotwell","Cancelled (Rain)","Away",0,0,0,0,0,0,0,0,0,0,1,0,0,0,0,0,1,0,0,0,0,0]
[41035,"Brightwell-Cum-Sotwell","Cancelled (Rain)","Away",0,0,0,0,0,0,0,0,0,0,2,0,0,0,0,0,2,0,0,0,0,0]
[41035,"Brightwell-Cum-Sotwell","Cancelled (Rain)","Away",0,0,0,0,0,0,0,0,0,0,3,0,0,0,0,0,3,0,0,0,0,0]
[41035,"Brightwell-Cum-Sotwell","Cancelled (Rain)","Away",0,0,0,0,0,0,0,0,0,0,4,0,0,0,0,0,4,0,0,0,0,0]
[41035,"Brightwell-Cum-Sotwell","Cancelled (Rain)","Away",0,0,0,0,0,0,0,0,0,0,5,0,0,0,0,0,5,0,0,0,0,0]
[41035,"Brightwell-Cum-Sotwell","Cancelled (Rain)","Away",0,0,0,0,0,0,0,0,0,0,6,0,0,0,0,0,6,0,0,0,0,0]
[41035,"Brightwell-Cum-Sotwell","Cancelled (Rain)","Away",0,0,0,0,0,0,0,0,0,0,7,0,0,0,0,0,7,0,0,0,0,0]
[41035,"Brightwell-Cum-Sotwell","Cancelled (Rain)","Away",0,0,0,0,0,0,0,0,0,0,8,0,0,0,0,0,8,0,0,0,0,0]
[41035,"Brightwell-Cum-Sotwell","Cancelled (Rain)","Away",0,0,0,0,0,0,0,0,0,0,9,0,0,0,0,0,9,0,0,0,0,0]
[41035,"Brightwell-Cum-Sotwell","Cancelled (Rain)","Away",0,0,0,0,0,0,0,0,0,0,10,0,0,0,0,0,10,0,0,0,0,0]
[41035,"Brightwell-Cum-Sotwell","Cancelled (Rain)","Away",0,0,0,0,0,0,0,0,0,0,11,0,0,0,0,0,11,0,0,0,0,0]
[41041,"Greys Green (1)","Cancelled (Rain)","Home",0,0,0,0,0,0,0,0,0,0,1,0,0,0,0,0,1,0,0,0,0,0]
[41041,"Greys Green (1)","Cancelled (Rain)","Home",0,0,0,0,0,0,0,0,0,0,2,0,0,0,0,0,2,0,0,0,0,0]
[41041,"Greys Green (1)","Cancelled (Rain)","Home",0,0,0,0,0,0,0,0,0,0,3,0,0,0,0,0,3,0,0,0,0,0]
[41041,"Greys Green (1)","Cancelled (Rain)","Home",0,0,0,0,0,0,0,0,0,0,4,0,0,0,0,0,4,0,0,0,0,0]
[41041,"Greys Green (1)","Cancelled (Rain)","Home",0,0,0,0,0,0,0,0,0,0,5,0,0,0,0,0,5,0,0,0,0,0]
[41041,"Greys Green (1)","Cancelled (Rain)","Home",0,0,0,0,0,0,0,0,0,0,6,0,0,0,0,0,6,0,0,0,0,0]
[41041,"Greys Green (1)","Cancelled (Rain)","Home",0,0,0,0,0,0,0,0,0,0,7,0,0,0,0,0,7,0,0,0,0,0]
[41041,"Greys Green (1)","Cancelled (Rain)","Home",0,0,0,0,0,0,0,0,0,0,8,0,0,0,0,0,8,0,0,0,0,0]
[41041,"Greys Green (1)","Cancelled (Rain)","Home",0,0,0,0,0,0,0,0,0,0,9,0,0,0,0,0,9,0,0,0,0,0]
[41041,"Greys Green (1)","Cancelled (Rain)","Home",0,0,0,0,0,0,0,0,0,0,10,0,0,0,0,0,10,0,0,0,0,0]
[41041,"Greys Green (1)","Cancelled (Rain)","Home",0,0,0,0,0,0,0,0,0,0,11,0,0,0,0,0,11,0,0,0,0,0]
[41048,"Crazies Hill","Win","Home","T. White","Second",178,6,177,3,49,36,6,6,1,"C. Simon",5,1,0,0,1,"N. Henry",9,3,0,19]
[41048,"Crazies Hill","Win","Home","T. White","Second",178,6,177,3,49,36,6,6,2,"S. Halfhead",13,1,0,0,2,"T. White",7,2,0,10]
[41048,"Crazies Hill","Win","Home","T. White","Second",178,6,177,3,49,36,6,6,3,"J. Hunt",80,0,1,0,3,"J. Hunt",11,2,0,26]
[41048,"Crazies Hill","Win","Home","T. White","Second",178,6,177,3,49,36,6,6,4,"R. Gunn",16,1,0,0,4,"M. Kemp",12,1,1,62]
[41048,"Crazies Hill","Win","Home","T. White","Second",178,6,177,3,49,36,6,6,5,"Ro. Dickie",33,1,0,0,5,"J. Reid",2,0,0,19]
[41048,"Crazies Hill","Win","Home","T. White","Second",178,6,177,3,49,36,6,6,6,"J. Reid",0,1,0,0,6,"S. Halfhead",6,0,1,21]
[41048,"Crazies Hill","Win","Home","T. White","Second",178,6,177,3,49,36,6,6,7,"N. Henry",20,1,0,0,7,"Ro. Dickie",2,0,1,14]
[41048,"Crazies Hill","Win","Home","T. White","Second",178,6,177,3,49,36,6,6,8,"M. Kemp",5,0,0,0,8,0,0,0,0,0]
[41048,"Crazies Hill","Win","Home","T. White","Second",178,6,177,3,49,36,6,6,9,0,0,0,0,0,9,0,0,0,0,0]
[41048,"Crazies Hill","Win","Home","T. White","Second",178,6,177,3,49,36,6,6,10,0,0,0,0,0,10,0,0,0,0,0]
[41048,"Crazies Hill","Win","Home","T. White","Second",178,6,177,3,49,36,6,6,11,0,0,0,0,0,11,0,0,0,0,0]
[41049,"Britwell Salome","Draw","Home","S. Beardall","First",217,3,163,3,39,34,7,1,1,"S. Beardall",60,1,1,0,1,"T. White",9,2,1,22]
[41049,"Britwell Salome","Draw","Home","S. Beardall","First",217,3,163,3,39,34,7,1,2,"J. Moberly",3,1,0,0,2,"P. Girdler",5,3,1,3]
[41049,"Britwell Salome","Draw","Home","S. Beardall","First",217,3,163,3,39,34,7,1,3,"J. Hancock",99,0,1,0,3,"N. Henry",7,0,0,45]
[41049,"Britwell Salome","Draw","Home","S. Beardall","First",217,3,163,3,39,34,7,1,4,"D. Stockings",41,1,0,0,4,"J. Hunt",6,1,0,34]
[41049,"Britwell Salome","Draw","Home","S. Beardall","First",217,3,163,3,39,34,7,1,5,"P. Girdler",7,0,0,0,5,"J. Hancock",4,0,1,18]
[41049,"Britwell Salome","Draw","Home","S. Beardall","First",217,3,163,3,39,34,7,1,6,0,0,0,0,0,6,"C. Henry",5,0,0,21]
[41049,"Britwell Salome","Draw","Home","S. Beardall","First",217,3,163,3,39,34,7,1,7,0,0,0,0,0,7,"D. Stockings",2,0,0,19]
[41049,"Britwell Salome","Draw","Home","S. Beardall","First",217,3,163,3,39,34,7,1,8,0,0,0,0,0,8,"J. Moberly",1,1,0,0]
[41049,"Britwell Salome","Draw","Home","S. Beardall","First",217,3,163,3,39,34,7,1,9,0,0,0,0,0,9,0,0,0,0,0]
[41049,"Britwell Salome","Draw","Home","S. Beardall","First",217,3,163,3,39,34,7,1,10,0,0,0,0,0,10,0,0,0,0,0]
[41049,"Britwell Salome","Draw","Home","S. Beardall","First",217,3,163,3,39,34,7,1,11,0,0,0,0,0,11,0,0,0,0,0]
[41055,"Harpsden (1)","Loss","Away","J. Hunt","First",150,10,151,7,33,38,16,25,1,"C. Simon",21,1,0,0,1,"N. Henry",9,2,0,36]
[41055,"Harpsden (1)","Loss","Away","J. Hunt","First",150,10,151,7,33,38,16,25,2,"Ro. Dickie",26,1,0,0,2,"J. Hunt",8,0,2,27]
[41055,"Harpsden (1)","Loss","Away","J. Hunt","First",150,10,151,7,33,38,16,25,3,"S. Bucknill",5,1,0,0,3,"N. Runkel",6,0,3,21]
[41055,"Harpsden (1)","Loss","Away","J. Hunt","First",150,10,151,7,33,38,16,25,4,"J. Hunt",53,1,1,0,4,"C. Henry",7,0,2,28]
[41055,"Harpsden (1)","Loss","Away","J. Hunt","First",150,10,151,7,33,38,16,25,5,"P. Briffett",0,1,0,0,5,"Ra. Dickie",2,0,0,5]
[41055,"Harpsden (1)","Loss","Away","J. Hunt","First",150,10,151,7,33,38,16,25,6,"J. Moberly",4,1,0,0,6,"P. Briffett",1,0,0,9]
[41055,"Harpsden (1)","Loss","Away","J. Hunt","First",150,10,151,7,33,38,16,25,7,"D. Mackey",0,1,0,0,7,0,0,0,0,0]
[41055,"Harpsden (1)","Loss","Away","J. Hunt","First",150,10,151,7,33,38,16,25,8,"N. Runkel",7,1,0,0,8,0,0,0,0,0]
[41055,"Harpsden (1)","Loss","Away","J. Hunt","First",150,10,151,7,33,38,16,25,9,"C. Henry",5,0,0,0,9,0,0,0,0,0]
[41055,"Harpsden (1)","Loss","Away","J. Hunt","First",150,10,151,7,33,38,16,25,10,"Ra. Dickie",4,1,0,0,10,0,0,0,0,0]
[41055,"Harpsden (1)","Loss","Away","J. Hunt","First",150,10,151,7,33,38,16,25,11,"N. Henry",9,1,0,0,11,0,0,0,0,0]
[41056,"Checkendon (1)","Win","Home","J. Hancock","Second",174,8,173,9,45,40,16,7,1,"O. Brett",3,1,0,0,1,"N. Henry",18,6,3,52]
[41056,"Checkendon (1)","Win","Home","J. Hancock","Second",174,8,173,9,45,40,16,7,2,"T. Wade",0,1,0,0,2,"H. De Zulueta",5,0,2,29]
[41056,"Checkendon (1)","Win","Home","J. Hancock","Second",174,8,173,9,45,40,16,7,3,"R. Gunn",13,1,0,0,3,"J. Kleiner-Mann",3,0,1,6]
[41056,"Checkendon (1)","Win","Home","J. Hancock","Second",174,8,173,9,45,40,16,7,4,"J. Kleiner-Mann",1,1,0,0,4,"C. Henry",7,0,0,25]
[41056,"Checkendon (1)","Win","Home","J. Hancock","Second",174,8,173,9,45,40,16,7,5,"J. Hancock",101,0,0,1,5,"J. Leefe",6,0,1,14]
[41056,"Checkendon (1)","Win","Home","J. Hancock","Second",174,8,173,9,45,40,16,7,6,"J. Leefe",13,1,0,0,6,"O. Brett",3,0,1,31]
[41056,"Checkendon (1)","Win","Home","J. Hancock","Second",174,8,173,9,45,40,16,7,7,"J. Moberly",14,1,0,0,7,"J. Moberly",3,0,1,9]
[41056,"Checkendon (1)","Win","Home","J. Hancock","Second",174,8,173,9,45,40,16,7,8,"H. De Zulueta",6,1,0,0,8,0,0,0,0,0]
[41056,"Checkendon (1)","Win","Home","J. Hancock","Second",174,8,173,9,45,40,16,7,9,"C. Henry",2,1,0,0,9,0,0,0,0,0]
[41056,"Checkendon (1)","Win","Home","J. Hancock","Second",174,8,173,9,45,40,16,7,10,"N. Henry",5,0,0,0,10,0,0,0,0,0]
[41056,"Checkendon (1)","Win","Home","J. Hancock","Second",174,8,173,9,45,40,16,7,11,0,0,0,0,0,11,0,0,0,0,0]
[41063,"Cuxham","Cancelled (Rain)","Home",0,0,0,0,0,0,0,0,0,0,1,0,0,0,0,0,1,0,0,0,0,0]
[41063,"Cuxham","Cancelled (Rain)","Home",0,0,0,0,0,0,0,0,0,0,2,0,0,0,0,0,2,0,0,0,0,0]
[41063,"Cuxham","Cancelled (Rain)","Home",0,0,0,0,0,0,0,0,0,0,3,0,0,0,0,0,3,0,0,0,0,0]
[41063,"Cuxham","Cancelled (Rain)","Home",0,0,0,0,0,0,0,0,0,0,4,0,0,0,0,0,4,0,0,0,0,0]
[41063,"Cuxham","Cancelled (Rain)","Home",0,0,0,0,0,0,0,0,0,0,5,0,0,0,0,0,5,0,0,0,0,0]
[41063,"Cuxham","Cancelled (Rain)","Home",0,0,0,0,0,0,0,0,0,0,6,0,0,0,0,0,6,0,0,0,0,0]
[41063,"Cuxham","Cancelled (Rain)","Home",0,0,0,0,0,0,0,0,0,0,7,0,0,0,0,0,7,0,0,0,0,0]
[41063,"Cuxham","Cancelled (Rain)","Home",0,0,0,0,0,0,0,0,0,0,8,0,0,0,0,0,8,0,0,0,0,0]
[41063,"Cuxham","Cancelled (Rain)","Home",0,0,0,0,0,0,0,0,0,0,9,0,0,0,0,0,9,0,0,0,0,0]
[41063,"Cuxham","Cancelled (Rain)","Home",0,0,0,0,0,0,0,0,0,0,10,0,0,0,0,0,10,0,0,0,0,0]
[41063,"Cuxham","Cancelled (Rain)","Home",0,0,0,0,0,0,0,0,0,0,11,0,0,0,0,0,11,0,0,0,0,0]
[41069,"Privateers","Draw","Home","J. Hunt","Second",113,8,163,7,49,41,8,9,1,"Ro. Dickie",2,1,0,0,1,"N. Henry",8,2,1,27]
[41069,"Privateers","Draw","Home","J. Hunt","Second",113,8,163,7,49,41,8,9,2,"J. Moberly",9,1,0,0,2,"J. Hunt",6,4,1,6]
[41069,"Privateers","Draw","Home","J. Hunt","Second",113,8,163,7,49,41,8,9,3,"J. Hancock",11,1,0,0,3,"O. Thornton",7,0,1,24]
[41069,"Privateers","Draw","Home","J. Hunt","Second",113,8,163,7,49,41,8,9,4,"O. Thornton",5,1,0,0,4,"N. Runkel",12,2,2,40]
[41069,"Privateers","Draw","Home","J. Hunt","Second",113,8,163,7,49,41,8,9,5,"P. Briffett",2,1,0,0,5,"J. Thornton",7,2,1,18]
[41069,"Privateers","Draw","Home","J. Hunt","Second",113,8,163,7,49,41,8,9,6,"J. Hunt",32,1,0,0,6,"C. Henry",5,0,0,20]
[41069,"Privateers","Draw","Home","J. Hunt","Second",113,8,163,7,49,41,8,9,7,"J. Thornton",2,1,0,0,7,"J. Hancock",4,1,1,19]
[41069,"Privateers","Draw","Home","J. Hunt","Second",113,8,163,7,49,41,8,9,8,"N. Henry",40,1,0,0,8,0,0,0,0,0]
[41069,"Privateers","Draw","Home","J. Hunt","Second",113,8,163,7,49,41,8,9,9,"N. Runkel",0,0,0,0,9,0,0,0,0,0]
[41069,"Privateers","Draw","Home","J. Hunt","Second",113,8,163,7,49,41,8,9,10,"C. Henry",2,0,0,0,10,0,0,0,0,0]
[41069,"Privateers","Draw","Home","J. Hunt","Second",113,8,163,7,49,41,8,9,11,0,0,0,0,0,11,0,0,0,0,0]
[41076,"Invalids","Draw","Home","S. Beardall","Second",130,6,130,7,44,30,8,11,1,"S. Beardall",42,1,0,0,1,"J. Leefe",6,0,0,25]
[41076,"Invalids","Draw","Home","S. Beardall","Second",130,6,130,7,44,30,8,11,2,"P. Briffett",6,1,0,0,2,"J. Hunt",4,1,1,5]
[41076,"Invalids","Draw","Home","S. Beardall","Second",130,6,130,7,44,30,8,11,3,"T. Wade",18,1,0,0,3,"N. Henry",8,0,0,30]
[41076,"Invalids","Draw","Home","S. Beardall","Second",130,6,130,7,44,30,8,11,4,"W. Strickland",8,1,0,0,4,"J. Hancock",9,2,1,8]
[41076,"Invalids","Draw","Home","S. Beardall","Second",130,6,130,7,44,30,8,11,5,"J. Hunt",13,1,0,0,5,"N. Runkel",9,1,2,18]
[41076,"Invalids","Draw","Home","S. Beardall","Second",130,6,130,7,44,30,8,11,6,"C. Simon",7,1,0,0,6,"S. Halfhead",8,1,2,33]
[41076,"Invalids","Draw","Home","S. Beardall","Second",130,6,130,7,44,30,8,11,7,"J. Hancock",21,0,0,0,7,"Run Out",0,0,1,0]
[41076,"Invalids","Draw","Home","S. Beardall","Second",130,6,130,7,44,30,8,11,8,"J. Leefe",7,0,0,0,8,0,0,0,0,0]
[41076,"Invalids","Draw","Home","S. Beardall","Second",130,6,130,7,44,30,8,11,9,0,0,0,0,0,9,0,0,0,0,0]
[41076,"Invalids","Draw","Home","S. Beardall","Second",130,6,130,7,44,30,8,11,10,0,0,0,0,0,10,0,0,0,0,0]
[41076,"Invalids","Draw","Home","S. Beardall","Second",130,6,130,7,44,30,8,11,11,0,0,0,0,0,11,0,0,0,0,0]
[41077,"Stonor (1)","Win","Away","S. Beardall","Second",130,4,129,10,37,25,12,3,1,"R. Dickie",6,1,0,0,1,"T. White",5,0,0,19]
[41077,"Stonor (1)","Win","Away","S. Beardall","Second",130,4,129,10,37,25,12,3,2,"J. Moberly",5,1,0,0,2,"J. Hunt",10,2,2,29]
[41077,"Stonor (1)","Win","Away","S. Beardall","Second",130,4,129,10,37,25,12,3,3,"T. Wade",5,1,0,0,3,"J. Hancock",12,2,5,35]
[41077,"Stonor (1)","Win","Away","S. Beardall","Second",130,4,129,10,37,25,12,3,4,"J. Hunt",45,0,0,0,4,"N. Henry",7,0,1,28]
[41077,"Stonor (1)","Win","Away","S. Beardall","Second",130,4,129,10,37,25,12,3,5,"P. Briffett",15,1,0,0,5,"D. Stockings",3,0,2,15]
[41077,"Stonor (1)","Win","Away","S. Beardall","Second",130,4,129,10,37,25,12,3,6,"J. Hancock",42,0,0,0,6,0,0,0,0,0]
[41077,"Stonor (1)","Win","Away","S. Beardall","Second",130,4,129,10,37,25,12,3,7,0,0,0,0,0,7,0,0,0,0,0]
[41077,"Stonor (1)","Win","Away","S. Beardall","Second",130,4,129,10,37,25,12,3,8,0,0,0,0,0,8,0,0,0,0,0]
[41077,"Stonor (1)","Win","Away","S. Beardall","Second",130,4,129,10,37,25,12,3,9,0,0,0,0,0,9,0,0,0,0,0]
[41077,"Stonor (1)","Win","Away","S. Beardall","Second",130,4,129,10,37,25,12,3,10,0,0,0,0,0,10,0,0,0,0,0]
[41077,"Stonor (1)","Win","Away","S. Beardall","Second",130,4,129,10,37,25,12,3,11,0,0,0,0,0,11,0,0,0,0,0]
[41084,"Theberton","Win","Home","S. Beardall","First",191,8,126,10,21,35,5,2,1,"S. Beardall",8,1,0,0,1,"J. Leefe",7,0,3,25]
[41084,"Theberton","Win","Home","S. Beardall","First",191,8,126,10,21,35,5,2,2,"O. Thornton",100,1,0,1,2,"J. Thornton",7,0,3,34]
[41084,"Theberton","Win","Home","S. Beardall","First",191,8,126,10,21,35,5,2,3,"P. Briffett",5,1,0,0,3,"N. Runkel",4,0,3,27]
[41084,"Theberton","Win","Home","S. Beardall","First",191,8,126,10,21,35,5,2,4,"C. Beardall",0,1,0,0,4,"N. Henry",3,0,1,38]
[41084,"Theberton","Win","Home","S. Beardall","First",191,8,126,10,21,35,5,2,5,"T. Wade",49,1,0,0,5,0,0,0,0,0]
[41084,"Theberton","Win","Home","S. Beardall","First",191,8,126,10,21,35,5,2,6,"S. Halfhead",0,1,0,0,6,0,0,0,0,0]
[41084,"Theberton","Win","Home","S. Beardall","First",191,8,126,10,21,35,5,2,7,"C. Simon",7,1,0,0,7,0,0,0,0,0]
[41084,"Theberton","Win","Home","S. Beardall","First",191,8,126,10,21,35,5,2,8,"J. Thornton",10,0,0,0,8,0,0,0,0,0]
[41084,"Theberton","Win","Home","S. Beardall","First",191,8,126,10,21,35,5,2,9,"N. Henry",5,1,0,0,9,0,0,0,0,0]
[41084,"Theberton","Win","Home","S. Beardall","First",191,8,126,10,21,35,5,2,10,"J. Leefe",2,0,0,0,10,0,0,0,0,0]
[41084,"Theberton","Win","Home","S. Beardall","First",191,8,126,10,21,35,5,2,11,0,0,0,0,0,11,0,0,0,0,0]
[41090,"Oporto","Win","Tour","S. Beardall","Second",168,6,166,10,45,41,33,1,1,"O. Thornton",17,1,0,0,1,"P. Girdler",6,0,1,30]
[41090,"Oporto","Win","Tour","S. Beardall","Second",168,6,166,10,45,41,33,1,2,"S. Halfhead",7,1,0,0,2,"T. White",4,0,0,12]
[41090,"Oporto","Win","Tour","S. Beardall","Second",168,6,166,10,45,41,33,1,3,"Ro. Dickie",3,1,0,0,3,"J. Thornton",7,0,1,45]
[41090,"Oporto","Win","Tour","S. Beardall","Second",168,6,166,10,45,41,33,1,4,"P. Briffett",9,1,0,0,4,"J. Hunt",4,0,0,14]
[41090,"Oporto","Win","Tour","S. Beardall","Second",168,6,166,10,45,41,33,1,5,"S. Beardall",4,1,0,0,5,"O. Thornton",5,2,2,9]
[41090,"Oporto","Win","Tour","S. Beardall","Second",168,6,166,10,45,41,33,1,6,"B. Bazell",9,1,0,0,6,"N. Runkel",11,3,2,17]
[41090,"Oporto","Win","Tour","S. Beardall","Second",168,6,166,10,45,41,33,1,7,"J. Hunt",57,0,1,0,7,"S. Halfhead",2,1,0,12]
[41090,"Oporto","Win","Tour","S. Beardall","Second",168,6,166,10,45,41,33,1,8,"J. Thornton",29,0,0,0,8,"P. Briffett",5,0,2,25]
[41090,"Oporto","Win","Tour","S. Beardall","Second",168,6,166,10,45,41,33,1,9,0,0,0,0,0,9,"Ro. Dickie",1,0,1,1]
[41090,"Oporto","Win","Tour","S. Beardall","Second",168,6,166,10,45,41,33,1,10,0,0,0,0,0,10,"Run Out",0,0,1,0]
[41090,"Oporto","Win","Tour","S. Beardall","Second",168,6,166,10,45,41,33,1,11,0,0,0,0,0,11,0,0,0,0,0]
[41091,"Oporto (2)","Win","Tour","S. Beardall","Second",184,10,136,10,39,41,41,15,1,"C. Simon",17,1,0,0,1,"P. Girdler",7,1,0,22]
[41091,"Oporto (2)","Win","Tour","S. Beardall","Second",184,10,136,10,39,41,41,15,2,"T. Farley",10,1,0,0,2,"J. Hunt",5,0,2,15]
[41091,"Oporto (2)","Win","Tour","S. Beardall","Second",184,10,136,10,39,41,41,15,3,"J. Hunt",11,1,0,0,3,"T. Farley",4,0,1,23]
[41091,"Oporto (2)","Win","Tour","S. Beardall","Second",184,10,136,10,39,41,41,15,4,"D. Stockings",8,1,0,0,4,"D. Stockings",1,0,0,18]
[41091,"Oporto (2)","Win","Tour","S. Beardall","Second",184,10,136,10,39,41,41,15,5,"T. Greenwood",2,1,0,0,5,"T. White",11,4,1,23]
[41091,"Oporto (2)","Win","Tour","S. Beardall","Second",184,10,136,10,39,41,41,15,6,"O. Thornton",56,1,1,0,6,"S. Beardall",6,2,1,15]
[41091,"Oporto (2)","Win","Tour","S. Beardall","Second",184,10,136,10,39,41,41,15,7,"S. Beardall",9,1,0,0,7,"J. Thornton",5,1,3,5]
[41091,"Oporto (2)","Win","Tour","S. Beardall","Second",184,10,136,10,39,41,41,15,8,"J. Thornton",18,1,0,0,8,"Run Out",0,0,2,0]
[41091,"Oporto (2)","Win","Tour","S. Beardall","Second",184,10,136,10,39,41,41,15,9,"P. Briffett",3,1,0,0,9,0,0,0,0,0]
[41091,"Oporto (2)","Win","Tour","S. Beardall","Second",184,10,136,10,39,41,41,15,10,"T. White",8,1,0,0,10,0,0,0,0,0]
[41091,"Oporto (2)","Win","Tour","S. Beardall","Second",184,10,136,10,39,41,41,15,11,"P. Girdler",1,0,0,0,11,0,0,0,0,0]
[41096,"Woodcote","Cancelled (Turville)","Away",0,0,0,0,0,0,0,0,0,0,1,0,0,0,0,0,1,0,0,0,0,0]
[41096,"Woodcote","Cancelled (Turville)","Away",0,0,0,0,0,0,0,0,0,0,2,0,0,0,0,0,2,0,0,0,0,0]
[41096,"Woodcote","Cancelled (Turville)","Away",0,0,0,0,0,0,0,0,0,0,3,0,0,0,0,0,3,0,0,0,0,0]
[41096,"Woodcote","Cancelled (Turville)","Away",0,0,0,0,0,0,0,0,0,0,4,0,0,0,0,0,4,0,0,0,0,0]
[41096,"Woodcote","Cancelled (Turville)","Away",0,0,0,0,0,0,0,0,0,0,5,0,0,0,0,0,5,0,0,0,0,0]
[41096,"Woodcote","Cancelled (Turville)","Away",0,0,0,0,0,0,0,0,0,0,6,0,0,0,0,0,6,0,0,0,0,0]
[41096,"Woodcote","Cancelled (Turville)","Away",0,0,0,0,0,0,0,0,0,0,7,0,0,0,0,0,7,0,0,0,0,0]
[41096,"Woodcote","Cancelled (Turville)","Away",0,0,0,0,0,0,0,0,0,0,8,0,0,0,0,0,8,0,0,0,0,0]
[41096,"Woodcote","Cancelled (Turville)","Away",0,0,0,0,0,0,0,0,0,0,9,0,0,0,0,0,9,0,0,0,0,0]
[41096,"Woodcote","Cancelled (Turville)","Away",0,0,0,0,0,0,0,0,0,0,10,0,0,0,0,0,10,0,0,0,0,0]
[41096,"Woodcote","Cancelled (Turville)","Away",0,0,0,0,0,0,0,0,0,0,11,0,0,0,0,0,11,0,0,0,0,0]
[41098,"Flycatchers","Cancelled (Rain)","Home",0,0,0,0,0,0,0,0,0,0,1,0,0,0,0,0,1,0,0,0,0,0]
[41098,"Flycatchers","Cancelled (Rain)","Home",0,0,0,0,0,0,0,0,0,0,2,0,0,0,0,0,2,0,0,0,0,0]
[41098,"Flycatchers","Cancelled (Rain)","Home",0,0,0,0,0,0,0,0,0,0,3,0,0,0,0,0,3,0,0,0,0,0]
[41098,"Flycatchers","Cancelled (Rain)","Home",0,0,0,0,0,0,0,0,0,0,4,0,0,0,0,0,4,0,0,0,0,0]
[41098,"Flycatchers","Cancelled (Rain)","Home",0,0,0,0,0,0,0,0,0,0,5,0,0,0,0,0,5,0,0,0,0,0]
[41098,"Flycatchers","Cancelled (Rain)","Home",0,0,0,0,0,0,0,0,0,0,6,0,0,0,0,0,6,0,0,0,0,0]
[41098,"Flycatchers","Cancelled (Rain)","Home",0,0,0,0,0,0,0,0,0,0,7,0,0,0,0,0,7,0,0,0,0,0]
[41098,"Flycatchers","Cancelled (Rain)","Home",0,0,0,0,0,0,0,0,0,0,8,0,0,0,0,0,8,0,0,0,0,0]
[41098,"Flycatchers","Cancelled (Rain)","Home",0,0,0,0,0,0,0,0,0,0,9,0,0,0,0,0,9,0,0,0,0,0]
[41098,"Flycatchers","Cancelled (Rain)","Home",0,0,0,0,0,0,0,0,0,0,10,0,0,0,0,0,10,0,0,0,0,0]
[41098,"Flycatchers","Cancelled (Rain)","Home",0,0,0,0,0,0,0,0,0,0,11,0,0,0,0,0,11,0,0,0,0,0]
[41105,"Ibstone","Win","Away","S. Beardall","First",200,9,61,10,32,42,1,7,1,"S. Halfhead",9,1,0,0,1,"T. White",8,7,8,4]
[41105,"Ibstone","Win","Away","S. Beardall","First",200,9,61,10,32,42,1,7,2,"J. Rogers",1,1,0,0,2,"S. Beardall",2,0,0,17]
[41105,"Ibstone","Win","Away","S. Beardall","First",200,9,61,10,32,42,1,7,3,"J. Hunt",64,1,1,0,3,"J. Rogers",10,2,2,27]
[41105,"Ibstone","Win","Away","S. Beardall","First",200,9,61,10,32,42,1,7,4,"C. Beardall",19,1,0,0,4,"C. Rogers",4,2,0,3]
[41105,"Ibstone","Win","Away","S. Beardall","First",200,9,61,10,32,42,1,7,5,"T. Wade",27,1,0,0,5,"J. Hancock",5,4,0,2]
[41105,"Ibstone","Win","Away","S. Beardall","First",200,9,61,10,32,42,1,7,6,"W. Strickland",0,1,0,0,6,"J. Hunt",3,2,0,1]
[41105,"Ibstone","Win","Away","S. Beardall","First",200,9,61,10,32,42,1,7,7,"J. Hancock",7,1,0,0,7,0,0,0,0,0]
[41105,"Ibstone","Win","Away","S. Beardall","First",200,9,61,10,32,42,1,7,8,"S. Beardall",55,0,1,0,8,0,0,0,0,0]
[41105,"Ibstone","Win","Away","S. Beardall","First",200,9,61,10,32,42,1,7,9,"B. Bazell",8,1,0,0,9,0,0,0,0,0]
[41105,"Ibstone","Win","Away","S. Beardall","First",200,9,61,10,32,42,1,7,10,"C. Rogers",9,1,0,0,10,0,0,0,0,0]
[41105,"Ibstone","Win","Away","S. Beardall","First",200,9,61,10,32,42,1,7,11,"T. White",0,0,0,0,11,0,0,0,0,0]
[41111,"Crossbatters","Loss","Home","S. Beardall","Second",62,10,179,8,35,22,2,12,1,"S. Beardall",23,1,0,0,1,"J. Hunt",5,0,3,9]
[41111,"Crossbatters","Loss","Home","S. Beardall","Second",62,10,179,8,35,22,2,12,2,"P. Briffett",1,1,0,0,2,"H. De Zulueta",6,0,1,35]
[41111,"Crossbatters","Loss","Home","S. Beardall","Second",62,10,179,8,35,22,2,12,3,"Ro. Dickie",8,1,0,0,3,"J. Leefe",8,1,0,29]
[41111,"Crossbatters","Loss","Home","S. Beardall","Second",62,10,179,8,35,22,2,12,4,"J. Hunt",25,1,0,0,4,"N. Henry",10,0,2,61]
[41111,"Crossbatters","Loss","Home","S. Beardall","Second",62,10,179,8,35,22,2,12,5,"J. Moberly",2,1,0,0,5,"D. Bradman",4,0,2,8]
[41111,"Crossbatters","Loss","Home","S. Beardall","Second",62,10,179,8,35,22,2,12,6,"J. Leefe",0,0,0,0,6,"P. Briffett",2,0,0,25]
[41111,"Crossbatters","Loss","Home","S. Beardall","Second",62,10,179,8,35,22,2,12,7,"P. De Zulueta",0,1,0,0,7,0,0,0,0,0]
[41111,"Crossbatters","Loss","Home","S. Beardall","Second",62,10,179,8,35,22,2,12,8,"R. Beardall",0,1,0,0,8,0,0,0,0,0]
[41111,"Crossbatters","Loss","Home","S. Beardall","Second",62,10,179,8,35,22,2,12,9,"H. De Zulueta",0,1,0,0,9,0,0,0,0,0]
[41111,"Crossbatters","Loss","Home","S. Beardall","Second",62,10,179,8,35,22,2,12,10,"D. Bradman",1,1,0,0,10,0,0,0,0,0]
[41111,"Crossbatters","Loss","Home","S. Beardall","Second",62,10,179,8,35,22,2,12,11,"N. Henry",0,1,0,0,11,0,0,0,0,0]
[41112,"Warborough","Draw","Home","S. Beardall","First",248,6,110,4,38,45,14,5,1,"C. Beardall",96,1,1,0,1,"J. Leefe",8,0,2,31]
[41112,"Warborough","Draw","Home","S. Beardall","First",248,6,110,4,38,45,14,5,2,"J. Rogers",8,1,0,0,2,"N. Henry",10,2,0,29]
[41112,"Warborough","Draw","Home","S. Beardall","First",248,6,110,4,38,45,14,5,3,"S. Beardall",76,1,1,0,3,"S. Flakelar",8,0,0,14]
[41112,"Warborough","Draw","Home","S. Beardall","First",248,6,110,4,38,45,14,5,4,"S. Flakelar",19,1,0,0,4,"C. Rogers",3,1,0,14]
[41112,"Warborough","Draw","Home","S. Beardall","First",248,6,110,4,38,45,14,5,5,"T. Wade",16,0,0,0,5,"J. Rogers",6,1,2,7]
[41112,"Warborough","Draw","Home","S. Beardall","First",248,6,110,4,38,45,14,5,6,"J. Moberly",13,1,0,0,6,"S. Beardall",2,1,0,5]
[41112,"Warborough","Draw","Home","S. Beardall","First",248,6,110,4,38,45,14,5,7,"C. Rogers",3,1,0,0,7,"T. Greenwood",1,0,0,5]
[41112,"Warborough","Draw","Home","S. Beardall","First",248,6,110,4,38,45,14,5,8,"J. Leefe",3,0,0,0,8,0,0,0,0,0]
[41112,"Warborough","Draw","Home","S. Beardall","First",248,6,110,4,38,45,14,5,9,0,0,0,0,0,9,0,0,0,0,0]
[41112,"Warborough","Draw","Home","S. Beardall","First",248,6,110,4,38,45,14,5,10,0,0,0,0,0,10,0,0,0,0,0]
[41112,"Warborough","Draw","Home","S. Beardall","First",248,6,110,4,38,45,14,5,11,0,0,0,0,0,11,0,0,0,0,0]
[41119,"Ipsden","Win","Home","S. Beardall","First",180,3,178,4,30,30,8,4,1,"C. Beardall",26,1,0,0,1,"S. Beardall",6,0,1,18]
[41119,"Ipsden","Win","Home","S. Beardall","First",180,3,178,4,30,30,8,4,2,"J. Rogers",24,1,0,0,2,"N. Henry",7,0,1,23]
[41119,"Ipsden","Win","Home","S. Beardall","First",180,3,178,4,30,30,8,4,3,"O. Thornton",103,0,0,1,3,"B. Watson",5,2,1,24]
[41119,"Ipsden","Win","Home","S. Beardall","First",180,3,178,4,30,30,8,4,4,"B. Watson",19,1,0,0,4,"C. Rogers",3,0,0,30]
[41119,"Ipsden","Win","Home","S. Beardall","First",180,3,178,4,30,30,8,4,5,"T. Wade",0,0,0,0,5,"J. Rogers",4,0,0,38]
[41119,"Ipsden","Win","Home","S. Beardall","First",180,3,178,4,30,30,8,4,6,0,0,0,0,0,6,"C. Henry",2,0,0,25]
[41119,"Ipsden","Win","Home","S. Beardall","First",180,3,178,4,30,30,8,4,7,0,0,0,0,0,7,"O. Thornton",3,0,1,16]
[41119,"Ipsden","Win","Home","S. Beardall","First",180,3,178,4,30,30,8,4,8,0,0,0,0,0,8,0,0,0,0,0]
[41119,"Ipsden","Win","Home","S. Beardall","First",180,3,178,4,30,30,8,4,9,0,0,0,0,0,9,0,0,0,0,0]
[41119,"Ipsden","Win","Home","S. Beardall","First",180,3,178,4,30,30,8,4,10,0,0,0,0,0,10,0,0,0,0,0]
[41119,"Ipsden","Win","Home","S. Beardall","First",180,3,178,4,30,30,8,4,11,0,0,0,0,0,11,0,0,0,0,0]
[41126,"Henley","Win","Away","S. Beardall","First",212,10,94,8,28,40,20,0,1,"J. Hunt",11,1,0,0,1,"T. White",6,0,2,22]
[41126,"Henley","Win","Away","S. Beardall","First",212,10,94,8,28,40,20,0,2,"J. Moberly",30,1,0,0,2,"J. Thornton",7,0,1,32]
[41126,"Henley","Win","Away","S. Beardall","First",212,10,94,8,28,40,20,0,3,"O. Thornton",1,1,0,0,3,"J. Hancock",5,0,2,9]
[41126,"Henley","Win","Away","S. Beardall","First",212,10,94,8,28,40,20,0,4,"J. Hancock",36,1,0,0,4,"N. Henry",8,0,2,29]
[41126,"Henley","Win","Away","S. Beardall","First",212,10,94,8,28,40,20,0,5,"S. Beardall",63,1,1,0,5,"J. Hunt",2,1,1,2]
[41126,"Henley","Win","Away","S. Beardall","First",212,10,94,8,28,40,20,0,6,"C. Beardall",31,1,0,0,6,0,0,0,0,0]
[41126,"Henley","Win","Away","S. Beardall","First",212,10,94,8,28,40,20,0,7,"Ro. Dickie",6,1,0,0,7,0,0,0,0,0]
[41126,"Henley","Win","Away","S. Beardall","First",212,10,94,8,28,40,20,0,8,"J. Thornton",5,1,0,0,8,0,0,0,0,0]
[41126,"Henley","Win","Away","S. Beardall","First",212,10,94,8,28,40,20,0,9,"S. Halfhead",6,1,0,0,9,0,0,0,0,0]
[41126,"Henley","Win","Away","S. Beardall","First",212,10,94,8,28,40,20,0,10,"N. Henry",2,1,0,0,10,0,0,0,0,0]
[41126,"Henley","Win","Away","S. Beardall","First",212,10,94,8,28,40,20,0,11,"T. White",1,0,0,0,11,0,0,0,0,0]
[41132,"West Wycombe","Cancelled (Opposition)","Home",0,0,0,0,0,0,0,0,0,0,1,0,0,0,0,0,1,0,0,0,0,0]
[41132,"West Wycombe","Cancelled (Opposition)","Home",0,0,0,0,0,0,0,0,0,0,2,0,0,0,0,0,2,0,0,0,0,0]
[41132,"West Wycombe","Cancelled (Opposition)","Home",0,0,0,0,0,0,0,0,0,0,3,0,0,0,0,0,3,0,0,0,0,0]
[41132,"West Wycombe","Cancelled (Opposition)","Home",0,0,0,0,0,0,0,0,0,0,4,0,0,0,0,0,4,0,0,0,0,0]
[41132,"West Wycombe","Cancelled (Opposition)","Home",0,0,0,0,0,0,0,0,0,0,5,0,0,0,0,0,5,0,0,0,0,0]
[41132,"West Wycombe","Cancelled (Opposition)","Home",0,0,0,0,0,0,0,0,0,0,6,0,0,0,0,0,6,0,0,0,0,0]
[41132,"West Wycombe","Cancelled (Opposition)","Home",0,0,0,0,0,0,0,0,0,0,7,0,0,0,0,0,7,0,0,0,0,0]
[41132,"West Wycombe","Cancelled (Opposition)","Home",0,0,0,0,0,0,0,0,0,0,8,0,0,0,0,0,8,0,0,0,0,0]
[41132,"West Wycombe","Cancelled (Opposition)","Home",0,0,0,0,0,0,0,0,0,0,9,0,0,0,0,0,9,0,0,0,0,0]
[41132,"West Wycombe","Cancelled (Opposition)","Home",0,0,0,0,0,0,0,0,0,0,10,0,0,0,0,0,10,0,0,0,0,0]
[41132,"West Wycombe","Cancelled (Opposition)","Home",0,0,0,0,0,0,0,0,0,0,11,0,0,0,0,0,11,0,0,0,0,0]
[41133,"Dorchester","Win","Home","S. Beardall","Second",213,5,212,6,46,38,5,0,1,"S. Beardall",86,1,1,0,1,"J. Thornton",9,3,0,29]
[41133,"Dorchester","Win","Home","S. Beardall","Second",213,5,212,6,46,38,5,0,2,"Ro. Dickie",15,1,0,0,2,"N. Henry",14,1,0,68]
[41133,"Dorchester","Win","Home","S. Beardall","Second",213,5,212,6,46,38,5,0,3,"N. Phillips",1,1,0,0,3,"J. Crook",7,0,1,49]
[41133,"Dorchester","Win","Home","S. Beardall","Second",213,5,212,6,46,38,5,0,4,"P. De Zulueta",43,1,0,0,4,"S. Beardall",4,0,4,22]
[41133,"Dorchester","Win","Home","S. Beardall","Second",213,5,212,6,46,38,5,0,5,"J. Crook",0,1,0,0,5,"C. Henry",7,3,0,26]
[41133,"Dorchester","Win","Home","S. Beardall","Second",213,5,212,6,46,38,5,0,6,"J. Thornton",51,0,1,0,6,"Ra. Dickie",5,1,0,18]
[41133,"Dorchester","Win","Home","S. Beardall","Second",213,5,212,6,46,38,5,0,7,"S. Halfhead",12,0,0,0,7,"Run Out",0,0,1,0]
[41133,"Dorchester","Win","Home","S. Beardall","Second",213,5,212,6,46,38,5,0,8,0,0,0,0,0,8,0,0,0,0,0]
[41133,"Dorchester","Win","Home","S. Beardall","Second",213,5,212,6,46,38,5,0,9,0,0,0,0,0,9,0,0,0,0,0]
[41133,"Dorchester","Win","Home","S. Beardall","Second",213,5,212,6,46,38,5,0,10,0,0,0,0,0,10,0,0,0,0,0]
[41133,"Dorchester","Win","Home","S. Beardall","Second",213,5,212,6,46,38,5,0,11,0,0,0,0,0,11,0,0,0,0,0]
[41140,"Odney","Draw","Home","S. Beardall","Second",113,5,181,10,37,34,17,6,1,"S. Beardall",6,1,0,0,1,"J. Leefe",8,0,3,32]
[41140,"Odney","Draw","Home","S. Beardall","Second",113,5,181,10,37,34,17,6,2,"Ro. Dickie",6,1,0,0,2,"O. Thornton",5,0,0,15]
[41140,"Odney","Draw","Home","S. Beardall","Second",113,5,181,10,37,34,17,6,3,"O. Thornton",37,1,0,0,3,"N. Henry",8,0,1,54]
[41140,"Odney","Draw","Home","S. Beardall","Second",113,5,181,10,37,34,17,6,4,"P. Briffett",1,1,0,0,4,"N. Runkel",11,0,6,40]
[41140,"Odney","Draw","Home","S. Beardall","Second",113,5,181,10,37,34,17,6,5,"J. Leefe",20,0,0,0,5,"C. Henry",4,0,0,29]
[41140,"Odney","Draw","Home","S. Beardall","Second",113,5,181,10,37,34,17,6,6,"N. Henry",21,1,0,0,6,"S. Beardall",1,0,0,5]
[41140,"Odney","Draw","Home","S. Beardall","Second",113,5,181,10,37,34,17,6,7,"B. Bazell",5,0,0,0,7,0,0,0,0,0]
[41140,"Odney","Draw","Home","S. Beardall","Second",113,5,181,10,37,34,17,6,8,0,0,0,0,0,8,0,0,0,0,0]
[41140,"Odney","Draw","Home","S. Beardall","Second",113,5,181,10,37,34,17,6,9,0,0,0,0,0,9,0,0,0,0,0]
[41140,"Odney","Draw","Home","S. Beardall","Second",113,5,181,10,37,34,17,6,10,0,0,0,0,0,10,0,0,0,0,0]
[41140,"Odney","Draw","Home","S. Beardall","Second",113,5,181,10,37,34,17,6,11,0,0,0,0,0,11,0,0,0,0,0]
[41146,"Stonor (2)","Cancelled (Rain)","Home",0,0,0,0,0,0,0,0,0,0,1,0,0,0,0,0,1,0,0,0,0,0]
[41146,"Stonor (2)","Cancelled (Rain)","Home",0,0,0,0,0,0,0,0,0,0,2,0,0,0,0,0,2,0,0,0,0,0]
[41146,"Stonor (2)","Cancelled (Rain)","Home",0,0,0,0,0,0,0,0,0,0,3,0,0,0,0,0,3,0,0,0,0,0]
[41146,"Stonor (2)","Cancelled (Rain)","Home",0,0,0,0,0,0,0,0,0,0,4,0,0,0,0,0,4,0,0,0,0,0]
[41146,"Stonor (2)","Cancelled (Rain)","Home",0,0,0,0,0,0,0,0,0,0,5,0,0,0,0,0,5,0,0,0,0,0]
[41146,"Stonor (2)","Cancelled (Rain)","Home",0,0,0,0,0,0,0,0,0,0,6,0,0,0,0,0,6,0,0,0,0,0]
[41146,"Stonor (2)","Cancelled (Rain)","Home",0,0,0,0,0,0,0,0,0,0,7,0,0,0,0,0,7,0,0,0,0,0]
[41146,"Stonor (2)","Cancelled (Rain)","Home",0,0,0,0,0,0,0,0,0,0,8,0,0,0,0,0,8,0,0,0,0,0]
[41146,"Stonor (2)","Cancelled (Rain)","Home",0,0,0,0,0,0,0,0,0,0,9,0,0,0,0,0,9,0,0,0,0,0]
[41146,"Stonor (2)","Cancelled (Rain)","Home",0,0,0,0,0,0,0,0,0,0,10,0,0,0,0,0,10,0,0,0,0,0]
[41146,"Stonor (2)","Cancelled (Rain)","Home",0,0,0,0,0,0,0,0,0,0,11,0,0,0,0,0,11,0,0,0,0,0]
[41153,"VPs","Loss","Away","S. Beardall","Second",238,8,254,4,40,40,26,14,1,"J. Hunt",98,1,1,0,1,"T. White",7,1,0,37]
[41153,"VPs","Loss","Away","S. Beardall","Second",238,8,254,4,40,40,26,14,2,"P. Briffett",5,1,0,0,2,"H. De Zulueta",5,0,0,30]
[41153,"VPs","Loss","Away","S. Beardall","Second",238,8,254,4,40,40,26,14,3,"S. Beardall",1,1,0,0,3,"S. Flakelar",6,0,1,40]
[41153,"VPs","Loss","Away","S. Beardall","Second",238,8,254,4,40,40,26,14,4,"T. Wade",33,1,0,0,4,"J. Hunt",6,0,0,20]
[41153,"VPs","Loss","Away","S. Beardall","Second",238,8,254,4,40,40,26,14,5,"P. De Zulueta",0,1,0,0,5,"N. Henry",5,0,0,40]
[41153,"VPs","Loss","Away","S. Beardall","Second",238,8,254,4,40,40,26,14,6,"J. Hancock",11,1,0,0,6,"J. Hancock",7,0,1,43]
[41153,"VPs","Loss","Away","S. Beardall","Second",238,8,254,4,40,40,26,14,7,"S. Flakelar",25,0,0,0,7,"C. Henry",2,0,1,9]
[41153,"VPs","Loss","Away","S. Beardall","Second",238,8,254,4,40,40,26,14,8,"T. White",10,1,0,0,8,"S. Beardall",2,0,1,21]
[41153,"VPs","Loss","Away","S. Beardall","Second",238,8,254,4,40,40,26,14,9,"C. Henry",1,1,0,0,9,0,0,0,0,0]
[41153,"VPs","Loss","Away","S. Beardall","Second",238,8,254,4,40,40,26,14,10,"H. De Zulueta",28,0,0,0,10,0,0,0,0,0]
[41153,"VPs","Loss","Away","S. Beardall","Second",238,8,254,4,40,40,26,14,11,0,0,0,0,0,11,0,0,0,0,0]
[41154,"Medmenham","Cancelled (Turville)","Home",0,0,0,0,0,0,0,0,0,0,1,0,0,0,0,0,1,0,0,0,0,0]
[41154,"Medmenham","Cancelled (Turville)","Home",0,0,0,0,0,0,0,0,0,0,2,0,0,0,0,0,2,0,0,0,0,0]
[41154,"Medmenham","Cancelled (Turville)","Home",0,0,0,0,0,0,0,0,0,0,3,0,0,0,0,0,3,0,0,0,0,0]
[41154,"Medmenham","Cancelled (Turville)","Home",0,0,0,0,0,0,0,0,0,0,4,0,0,0,0,0,4,0,0,0,0,0]
[41154,"Medmenham","Cancelled (Turville)","Home",0,0,0,0,0,0,0,0,0,0,5,0,0,0,0,0,5,0,0,0,0,0]
[41154,"Medmenham","Cancelled (Turville)","Home",0,0,0,0,0,0,0,0,0,0,6,0,0,0,0,0,6,0,0,0,0,0]
[41154,"Medmenham","Cancelled (Turville)","Home",0,0,0,0,0,0,0,0,0,0,7,0,0,0,0,0,7,0,0,0,0,0]
[41154,"Medmenham","Cancelled (Turville)","Home",0,0,0,0,0,0,0,0,0,0,8,0,0,0,0,0,8,0,0,0,0,0]
[41154,"Medmenham","Cancelled (Turville)","Home",0,0,0,0,0,0,0,0,0,0,9,0,0,0,0,0,9,0,0,0,0,0]
[41154,"Medmenham","Cancelled (Turville)","Home",0,0,0,0,0,0,0,0,0,0,10,0,0,0,0,0,10,0,0,0,0,0]
[41154,"Medmenham","Cancelled (Turville)","Home",0,0,0,0,0,0,0,0,0,0,11,0,0,0,0,0,11,0,0,0,0,0]
[41160,"Wylde Oats","Draw","Home","J. Hancock","First",245,4,113,6,39,36,25,4,1,"A. Bignell",0,1,0,0,1,"O. Thornton",9,2,2,28]
[41160,"Wylde Oats","Draw","Home","J. Hancock","First",245,4,113,6,39,36,25,4,2,"Ro. Dickie",9,1,0,0,2,"N. Henry",7,1,2,14]
[41160,"Wylde Oats","Draw","Home","J. Hancock","First",245,4,113,6,39,36,25,4,3,"P. Briffett",72,1,1,0,3,"N. Runkel",11,2,2,35]
[41160,"Wylde Oats","Draw","Home","J. Hancock","First",245,4,113,6,39,36,25,4,4,"O. Thornton",51,1,1,0,4,"J. Thornton",3,0,0,4]
[41160,"Wylde Oats","Draw","Home","J. Hancock","First",245,4,113,6,39,36,25,4,5,"C. Beardall",80,0,1,0,5,"O. Brett",2,0,0,9]
[41160,"Wylde Oats","Draw","Home","J. Hancock","First",245,4,113,6,39,36,25,4,6,"J. Thornton",8,0,0,0,6,"A. Bignell",4,0,0,14]
[41160,"Wylde Oats","Draw","Home","J. Hancock","First",245,4,113,6,39,36,25,4,7,0,0,0,0,0,7,"J. Hancock",3,1,0,5]
[41160,"Wylde Oats","Draw","Home","J. Hancock","First",245,4,113,6,39,36,25,4,8,0,0,0,0,0,8,0,0,0,0,0]
[41160,"Wylde Oats","Draw","Home","J. Hancock","First",245,4,113,6,39,36,25,4,9,0,0,0,0,0,9,0,0,0,0,0]
[41160,"Wylde Oats","Draw","Home","J. Hancock","First",245,4,113,6,39,36,25,4,10,0,0,0,0,0,10,0,0,0,0,0]
[41160,"Wylde Oats","Draw","Home","J. Hancock","First",245,4,113,6,39,36,25,4,11,0,0,0,0,0,11,0,0,0,0,0]
[41161,"Middleton Stoney","Draw","Home","J. Hunt","First",210,8,131,8,38,41,23,3,1,"O. Thornton",72,1,1,0,1,"J. Leefe",8,2,1,27]
[41161,"Middleton Stoney","Draw","Home","J. Hunt","First",210,8,131,8,38,41,23,3,2,"J. Moberly",8,1,0,0,2,"T. White",11,3,1,38]
[41161,"Middleton Stoney","Draw","Home","J. Hunt","First",210,8,131,8,38,41,23,3,3,"S. Bucknill",47,1,0,0,3,"B. Bucknill",5,1,3,20]
[41161,"Middleton Stoney","Draw","Home","J. Hunt","First",210,8,131,8,38,41,23,3,4,"T. Wade",10,1,0,0,4,"N. Henry",3,0,1,19]
[41161,"Middleton Stoney","Draw","Home","J. Hunt","First",210,8,131,8,38,41,23,3,5,"J. Hunt",41,0,0,0,5,"O. Thornton",4,4,0,0]
[41161,"Middleton Stoney","Draw","Home","J. Hunt","First",210,8,131,8,38,41,23,3,6,"C. Beardall",1,1,0,0,6,"C. Beardall",3,2,0,2]
[41161,"Middleton Stoney","Draw","Home","J. Hunt","First",210,8,131,8,38,41,23,3,7,"N. Henry",0,1,0,0,7,"J. Hunt",3,0,1,15]
[41161,"Middleton Stoney","Draw","Home","J. Hunt","First",210,8,131,8,38,41,23,3,8,"J. Leefe",6,1,0,0,8,"J. Moberly",1,0,1,7]
[41161,"Middleton Stoney","Draw","Home","J. Hunt","First",210,8,131,8,38,41,23,3,9,"B. Bucknill",1,1,0,0,9,0,0,0,0,0]
[41161,"Middleton Stoney","Draw","Home","J. Hunt","First",210,8,131,8,38,41,23,3,10,"T. White",1,0,0,0,10,0,0,0,0,0]
[41161,"Middleton Stoney","Draw","Home","J. Hunt","First",210,8,131,8,38,41,23,3,11,0,0,0,0,0,11,0,0,0,0,0]
[41167,"Harpsden (2)","Win","Home","J. Hunt","Second",135,6,133,10,40,33,5,6,1,"J. Leefe",0,1,0,0,1,"T. White",6,0,2,27]
[41167,"Harpsden (2)","Win","Home","J. Hunt","Second",135,6,133,10,40,33,5,6,2,"J. Moberly",2,1,0,0,2,"P. Girdler",7,2,1,28]
[41167,"Harpsden (2)","Win","Home","J. Hunt","Second",135,6,133,10,40,33,5,6,3,"C. Beardall",3,1,0,0,3,"J. Hunt",8,1,5,11]
[41167,"Harpsden (2)","Win","Home","J. Hunt","Second",135,6,133,10,40,33,5,6,4,"T. Wade",20,1,0,0,4,"J. Leefe",5,1,0,23]
[41167,"Harpsden (2)","Win","Home","J. Hunt","Second",135,6,133,10,40,33,5,6,5,"S. Halfhead",28,0,0,0,5,"A. Bignell",7,3,2,16]
[41167,"Harpsden (2)","Win","Home","J. Hunt","Second",135,6,133,10,40,33,5,6,6,"J. Hunt",6,1,0,0,6,"J. Hancock",7,2,0,22]
[41167,"Harpsden (2)","Win","Home","J. Hunt","Second",135,6,133,10,40,33,5,6,7,"J. Hancock",52,1,1,0,7,0,0,0,0,0]
[41167,"Harpsden (2)","Win","Home","J. Hunt","Second",135,6,133,10,40,33,5,6,8,"A. Bignell",19,0,0,0,8,0,0,0,0,0]
[41167,"Harpsden (2)","Win","Home","J. Hunt","Second",135,6,133,10,40,33,5,6,9,0,0,0,0,0,9,0,0,0,0,0]
[41167,"Harpsden (2)","Win","Home","J. Hunt","Second",135,6,133,10,40,33,5,6,10,0,0,0,0,0,10,0,0,0,0,0]
[41167,"Harpsden (2)","Win","Home","J. Hunt","Second",135,6,133,10,40,33,5,6,11,0,0,0,0,0,11,0,0,0,0,0]
[41174,"Checkendon (2)","Loss","Away","J. Hancock","Second",89,10,174,10,46,28,11,12,1,"P. Briffett",0,1,0,0,1,"K. Haig",10,1,1,23]
[41174,"Checkendon (2)","Loss","Away","J. Hancock","Second",89,10,174,10,46,28,11,12,2,"J. Moberly",4,1,0,0,2,"J. Hunt",14,2,4,36]
[41174,"Checkendon (2)","Loss","Away","J. Hancock","Second",89,10,174,10,46,28,11,12,3,"R. Hunt",15,1,0,0,3,"C. Beardall",5,0,1,28]
[41174,"Checkendon (2)","Loss","Away","J. Hancock","Second",89,10,174,10,46,28,11,12,4,"C. Beardall",19,1,0,0,4,"J. Moberly",7,1,1,43]
[41174,"Checkendon (2)","Loss","Away","J. Hancock","Second",89,10,174,10,46,28,11,12,5,"T. Wade",12,1,0,0,5,"J. Hancock",6,1,2,16]
[41174,"Checkendon (2)","Loss","Away","J. Hancock","Second",89,10,174,10,46,28,11,12,6,"V. Haig",11,1,0,0,6,"P. Briffett",4,0,1,16]
[41174,"Checkendon (2)","Loss","Away","J. Hancock","Second",89,10,174,10,46,28,11,12,7,"J. Hunt",3,1,0,0,7,0,0,0,0,0]
[41174,"Checkendon (2)","Loss","Away","J. Hancock","Second",89,10,174,10,46,28,11,12,8,"P. Sheriff",12,1,0,0,8,0,0,0,0,0]
[41174,"Checkendon (2)","Loss","Away","J. Hancock","Second",89,10,174,10,46,28,11,12,9,"J. Hancock",1,1,0,0,9,0,0,0,0,0]
[41174,"Checkendon (2)","Loss","Away","J. Hancock","Second",89,10,174,10,46,28,11,12,10,"C. Wellbelove",0,1,0,0,10,0,0,0,0,0]
[41174,"Checkendon (2)","Loss","Away","J. Hancock","Second",89,10,174,10,46,28,11,12,11,"T. Greenwood",1,0,0,0,11,0,0,0,0,0]
[41181,"Greys Green (2)","Win","Away","S. Beardall","Second",190,6,185,7,50,37,4,13,1,"J. Moberly",27,1,0,0,1,"T. White",10,2,0,28]
[41181,"Greys Green (2)","Win","Away","S. Beardall","Second",190,6,185,7,50,37,4,13,2,"P. Briffett",5,1,0,0,2,"A. Bignell",11,5,0,23]
[41181,"Greys Green (2)","Win","Away","S. Beardall","Second",190,6,185,7,50,37,4,13,3,"C. Beardall",20,1,0,0,3,"J. Hunt",6,2,0,9]
[41181,"Greys Green (2)","Win","Away","S. Beardall","Second",190,6,185,7,50,37,4,13,4,"J. Hunt",27,1,0,0,4,"S. Beardall",7,1,1,24]
[41181,"Greys Green (2)","Win","Away","S. Beardall","Second",190,6,185,7,50,37,4,13,5,"T. Wade",1,1,0,0,5,"N. Runkel",10,1,2,45]
[41181,"Greys Green (2)","Win","Away","S. Beardall","Second",190,6,185,7,50,37,4,13,6,"S. Beardall",74,0,1,0,6,"Ro. Dickie",2,0,0,29]
[41181,"Greys Green (2)","Win","Away","S. Beardall","Second",190,6,185,7,50,37,4,13,7,"Ro. Dickie",0,1,0,0,7,"C. Beardall",4,0,3,14]
[41181,"Greys Green (2)","Win","Away","S. Beardall","Second",190,6,185,7,50,37,4,13,8,"A. Bignell",32,0,0,0,8,"Run Out",0,0,1,0]
[41181,"Greys Green (2)","Win","Away","S. Beardall","Second",190,6,185,7,50,37,4,13,9,0,0,0,0,0,9,0,0,0,0,0]
[41181,"Greys Green (2)","Win","Away","S. Beardall","Second",190,6,185,7,50,37,4,13,10,0,0,0,0,0,10,0,0,0,0,0]
[41181,"Greys Green (2)","Win","Away","S. Beardall","Second",190,6,185,7,50,37,4,13,11,0,0,0,0,0,11,0,0,0,0,0]

{"sheet":"Penn Street","index":5,"n_rows":36,"n_cols":39,"rows_kept":36,"merged":[[2,2,2,10],[4,5,4,8],[21,5,21,10]]}
[]
[{"$nulls":13},"Date","Opposition","Match Status","Home/Away","Captain","TPCC Batting First","TPCC Team Score","TPCC Team Wickets","Opposition Team Score","Opposition Team Wickets","TPCC Overs Bowled","TPCC Overs Faced","Batting Extras","Bowling Extras","Batsmen Position","Batsmen Name","Batsmen Runs","Batsmen Out",50,100,"Bowler Position","Bowler Name","Bowler Overs","Bowler Maidens","Bowler Wickets","Bowler Runs"]
[null,null,"Match Overview",{"$nulls":10},{"$f":"$D$5","v":41021},{"$f":"$D$7","v":"Penn Street"},{"$f":"$D$9","v":"Cancelled (Rain)"},{"$f":"$D$11","v":"Away"},{"$f":"$D$24","v":0},{"$f":"$D$13","v":0},{"$f":"$D$15","v":0},{"$f":"$D$16","v":0},{"$f":"$D$18","v":0},{"$f":"$D$19","v":0},{"$f":"$D$21","v":0},{"$f":"$D$22","v":0},{"$f":"$H$19","v":0},{"$f":"$H$36","v":0},{"$f":"F7","v":1},{"$f":"G7","v":0},{"$f":"H7","v":0},{"$f":"I7","v":0},{"$f":"(IF(AD3>49,1,0))-AG3","v":0},{"$f":"IF(AD3>99,1,0)","v":0},{"$f":"F24","v":1},{"$f":"G24","v":0},0,0,0,0]
[{"$nulls":13},41021,"Penn Street","Cancelled (Rain)","Away",{"$f":"$D$24","v":0},0,0,0,0,0,0,0,0,0,{"$f":"F8","v":2},0,0,0,{"$f":"(IF(AD4>49,1,0))-AG4","v":0},{"$f":"IF(AD4>99,1,0)","v":0},{"$f":"F25","v":2},0,0,0,0,0]
[null,null,"Date","2012-04-22",null,"Batting ",{"$nulls":7},41021,"Penn Street","Cancelled (Rain)","Away",0,0,0,0,0,0,0,0,0,0,3,0,0,0,0,0,3,0,0,0,0,0]
[{"$nulls":5},"Position","Name","Runs","Out",{"$nulls":4},41021,"Penn Street","Cancelled (Rain)","Away",0,0,0,0,0,0,0,0,0,0,4,0,0,0,0,0,4,0,0,0,0,0]
[null,null,"Opposition","Penn Street",null,1,{"$nulls":7},41021,"Penn Street","Cancelled (Rain)","Away",0,0,0,0,0,0,0,0,0,0,5,0,0,0,0,0,5,0,0,0,0,0]
[{"$nulls":5},2,{"$nulls":7},41021,"Penn Street","Cancelled (Rain)","Away",0,0,0,0,0,0,0,0,0,0,6,0,0,0,0,0,6,0,0,0,0,0]
[null,null,"Match Status","Cancelled (Rain)",null,3,{"$nulls":7},41021,"Penn Street","Cancelled (Rain)","Away",0,0,0,0,0,0,0,0,0,0,7,0,0,0,0,0,7,0,0,0,0,0]
[{"$nulls":5},4,{"$nulls":7},41021,"Penn Street","Cancelled (Rain)","Away",0,0,0,0,0,0,0,0,0,0,8,0,0,0,0,0,8,0,0,0,0,0]
[null,null,"Home / Away","Away",null,5,{"$nulls":7},41021,"Penn Street","Cancelled (Rain)","Away",0,0,0,0,0,0,0,0,0,0,9,0,0,0,0,0,9,0,0,0,0,0]
[{"$nulls":5},6,{"$nulls":7},41021,"Penn Street","Cancelled (Rain)","Away",0,0,0,0,0,0,0,0,0,0,10,0,0,0,0,0,10,0,0,0,0,0]
[null,null,"TPCC Batting First",null,null,7,{"$nulls":7},41021,"Penn Street","Cancelled (Rain)","Away",0,0,0,0,0,0,0,0,0,0,11,0,0,0,0,0,11,0,0,0,0,0]
[{"$nulls":5},8]
[null,null,"TPCC Team Score",{"$f":"SUM(H7:H17)+H19","v":0},null,9]
[null,null,"TPCC Team Wickets",{"$f":"SUM(I7:I17)","v":0},null,10]
[{"$nulls":5},11]
[null,null,"Opposition Team Score",{"$f":"SUM(K24:K34)+H36","v":0}]
[null,null,"Opposition Team Wickets",{"$f":"SUM(J24:J34)","v":0},null,"Total Extras"]
[]
[null,null,"TPCC Overs Bowled",{"$f":"SUM(H24:H34)","v":0}]
[null,null,"Opposition Overs Bowled",null,null,"Bowling"]
[{"$nulls":5},"Position","Name","Overs","Maidens","Wickets","Runs"]
[null,null,"TPCC Captain",null,null,1]
[{"$nulls":5},2]
[{"$nulls":5},3]
[{"$nulls":5},4]
[{"$nulls":5},5]
[{"$nulls":5},6]
[{"$nulls":5},7]
[{"$nulls":5},8]
[{"$nulls":5},9]
[{"$nulls":5},10]
[{"$nulls":5},11]
[]
[{"$nulls":5},"Bowling Extras"]

{"sheet":"White Waltham","index":6,"n_rows":36,"n_cols":39,"rows_kept":36,"merged":[[2,2,2,10],[4,5,4,8],[21,5,21,10]]}
[]
[{"$nulls":13},"Date","Opposition","Match Status","Home/Away","Captain","TPCC Batting First","TPCC Team Score","TPCC Team Wickets","Opposition Team Score","Opposition Team Wickets","TPCC Overs Bowled","TPCC Overs Faced","Batting Extras","Bowling Extras","Batsmen Position","Batsmen Name","Batsmen Runs","Batsmen Out",50,100,"Bowler Position","Bowler Name","Bowler Overs","Bowler Maidens","Bowler Wickets","Bowler Runs"]
[null,null,"Match Overview",{"$nulls":10},{"$f":"$D$5","v":41028},{"$f":"$D$7","v":"White Waltham"},{"$f":"$D$9","v":"Cancelled (Rain)"},{"$f":"$D$11","v":"Home"},{"$f":"$D$24","v":0},{"$f":"$D$13","v":0},{"$f":"$D$15","v":0},{"$f":"$D$16","v":0},{"$f":"$D$18","v":0},{"$f":"$D$19","v":0},{"$f":"$D$21","v":0},{"$f":"$D$22","v":0},{"$f":"$H$19","v":0},{"$f":"$H$36","v":0},{"$f":"F7","v":1},{"$f":"G7","v":0},{"$f":"H7","v":0},{"$f":"I7","v":0},{"$f":"(IF(AD3>49,1,0))-AG3","v":0},{"$f":"IF(AD3>99,1,0)","v":0},{"$f":"F24","v":1},{"$f":"G24","v":0},0,0,0,0]
[{"$nulls":13},41028,"White Waltham","Cancelled (Rain)","Home",{"$f":"$D$24","v":0},0,0,0,0,0,0,0,0,0,{"$f":"F8","v":2},0,0,0,{"$f":"(IF(AD4>49,1,0))-AG4","v":0},{"$f":"IF(AD4>99,1,0)","v":0},{"$f":"F25","v":2},0,0,0,0,0]
[null,null,"Date","2012-04-29",null,"Batting ",{"$nulls":7},41028,"White Waltham","Cancelled (Rain)","Home",0,0,0,0,0,0,0,0,0,0,3,0,0,0,0,0,3,0,0,0,0,0]
[{"$nulls":5},"Position","Name","Runs","Out",{"$nulls":4},41028,"White Waltham","Cancelled (Rain)","Home",0,0,0,0,0,0,0,0,0,0,4,0,0,0,0,0,4,0,0,0,0,0]
[null,null,"Opposition","White Waltham",null,1,{"$nulls":7},41028,"White Waltham","Cancelled (Rain)","Home",0,0,0,0,0,0,0,0,0,0,5,0,0,0,0,0,5,0,0,0,0,0]
[{"$nulls":5},2,{"$nulls":7},41028,"White Waltham","Cancelled (Rain)","Home",0,0,0,0,0,0,0,0,0,0,6,0,0,0,0,0,6,0,0,0,0,0]
[null,null,"Match Status","Cancelled (Rain)",null,3,{"$nulls":7},41028,"White Waltham","Cancelled (Rain)","Home",0,0,0,0,0,0,0,0,0,0,7,0,0,0,0,0,7,0,0,0,0,0]
[{"$nulls":5},4,{"$nulls":7},41028,"White Waltham","Cancelled (Rain)","Home",0,0,0,0,0,0,0,0,0,0,8,0,0,0,0,0,8,0,0,0,0,0]
[null,null,"Home / Away","Home",null,5,{"$nulls":7},41028,"White Waltham","Cancelled (Rain)","Home",0,0,0,0,0,0,0,0,0,0,9,0,0,0,0,0,9,0,0,0,0,0]
[{"$nulls":5},6,{"$nulls":7},41028,"White Waltham","Cancelled (Rain)","Home",0,0,0,0,0,0,0,0,0,0,10,0,0,0,0,0,10,0,0,0,0,0]
[null,null,"TPCC Batting First",null,null,7,{"$nulls":7},41028,"White Waltham","Cancelled (Rain)","Home",0,0,0,0,0,0,0,0,0,0,11,0,0,0,0,0,11,0,0,0,0,0]
[{"$nulls":5},8]
[null,null,"TPCC Team Score",{"$f":"SUM(H7:H17)+H19","v":0},null,9]
[null,null,"TPCC Team Wickets",{"$f":"SUM(I7:I17)","v":0},null,10]
[{"$nulls":5},11]
[null,null,"Opposition Team Score",{"$f":"SUM(K24:K34)+H36","v":0}]
[null,null,"Opposition Team Wickets",{"$f":"SUM(J24:J34)","v":0},null,"Batting Extras"]
[]
[null,null,"TPCC Overs Bowled",{"$f":"SUM(H24:H34)","v":0}]
[null,null,"Opposition Overs Bowled",null,null,"Bowling"]
[{"$nulls":5},"Position","Name","Overs","Maidens","Wickets","Runs"]
[null,null,"TPCC Captain",null,null,1]
[{"$nulls":5},2]
[{"$nulls":5},3]
[{"$nulls":5},4]
[{"$nulls":5},5]
[{"$nulls":5},6]
[{"$nulls":5},7]
[{"$nulls":5},8]
[{"$nulls":5},9]
[{"$nulls":5},10]
[{"$nulls":5},11]
[]
[{"$nulls":5},"Bowling Extras"]

{"sheet":"Brightwell-Cum-Sotwell","index":7,"n_rows":36,"n_cols":39,"rows_kept":36,"merged":[[2,2,2,10],[4,5,4,8],[21,5,21,10]]}
[]
[{"$nulls":13},"Date","Opposition","Match Status","Home/Away","Captain","TPCC Batting First","TPCC Team Score","TPCC Team Wickets","Opposition Team Score","Opposition Team Wickets","TPCC Overs Bowled","TPCC Overs Faced","Batting Extras","Bowling Extras","Batsmen Position","Batsmen Name","Batsmen Runs","Batsmen Out",50,100,"Bowler Position","Bowler Name","Bowler Overs","Bowler Maidens","Bowler Wickets","Bowler Runs"]
[null,null,"Match Overview",{"$nulls":10},{"$f":"$D$5","v":41035},{"$f":"$D$7","v":"Brightwell-Cum-Sotwell"},{"$f":"$D$9","v":"Cancelled (Rain)"},{"$f":"$D$11","v":"Away"},{"$f":"$D$24","v":0},{"$f":"$D$13","v":0},{"$f":"$D$15","v":0},{"$f":"$D$16","v":0},{"$f":"$D$18","v":0},{"$f":"$D$19","v":0},{"$f":"$D$21","v":0},{"$f":"$D$22","v":0},{"$f":"$H$19","v":0},{"$f":"$H$36","v":0},{"$f":"F7","v":1},{"$f":"G7","v":0},{"$f":"H7","v":0},{"$f":"I7","v":0},{"$f":"(IF(AD3>49,1,0))-AG3","v":0},{"$f":"IF(AD3>99,1,0)","v":0},{"$f":"F24","v":1},{"$f":"G24","v":0},0,0,0,0]
[{"$nulls":13},41035,"Brightwell-Cum-Sotwell","Cancelled (Rain)","Away",{"$f":"$D$24","v":0},0,0,0,0,0,0,0,0,0,{"$f":"F8","v":2},0,0,0,{"$f":"(IF(AD4>49,1,0))-AG4","v":0},{"$f":"IF(AD4>99,1,0)","v":0},{"$f":"F25","v":2},0,0,0,0,0]
[null,null,"Date","2012-05-06",null,"Batting ",{"$nulls":7},41035,"Brightwell-Cum-Sotwell","Cancelled (Rain)","Away",0,0,0,0,0,0,0,0,0,0,3,0,0,0,0,0,3,0,0,0,0,0]
[{"$nulls":5},"Position","Name","Runs","Out",{"$nulls":4},41035,"Brightwell-Cum-Sotwell","Cancelled (Rain)","Away",0,0,0,0,0,0,0,0,0,0,4,0,0,0,0,0,4,0,0,0,0,0]
[null,null,"Opposition","Brightwell-Cum-Sotwell",null,1,{"$nulls":7},41035,"Brightwell-Cum-Sotwell","Cancelled (Rain)","Away",0,0,0,0,0,0,0,0,0,0,5,0,0,0,0,0,5,0,0,0,0,0]
[{"$nulls":5},2,{"$nulls":7},41035,"Brightwell-Cum-Sotwell","Cancelled (Rain)","Away",0,0,0,0,0,0,0,0,0,0,6,0,0,0,0,0,6,0,0,0,0,0]
[null,null,"Match Status","Cancelled (Rain)",null,3,{"$nulls":7},41035,"Brightwell-Cum-Sotwell","Cancelled (Rain)","Away",0,0,0,0,0,0,0,0,0,0,7,0,0,0,0,0,7,0,0,0,0,0]
[{"$nulls":5},4,{"$nulls":7},41035,"Brightwell-Cum-Sotwell","Cancelled (Rain)","Away",0,0,0,0,0,0,0,0,0,0,8,0,0,0,0,0,8,0,0,0,0,0]
[null,null,"Home / Away","Away",null,5,{"$nulls":7},41035,"Brightwell-Cum-Sotwell","Cancelled (Rain)","Away",0,0,0,0,0,0,0,0,0,0,9,0,0,0,0,0,9,0,0,0,0,0]
[{"$nulls":5},6,{"$nulls":7},41035,"Brightwell-Cum-Sotwell","Cancelled (Rain)","Away",0,0,0,0,0,0,0,0,0,0,10,0,0,0,0,0,10,0,0,0,0,0]
[null,null,"TPCC Batting First",null,null,7,{"$nulls":7},41035,"Brightwell-Cum-Sotwell","Cancelled (Rain)","Away",0,0,0,0,0,0,0,0,0,0,11,0,0,0,0,0,11,0,0,0,0,0]
[{"$nulls":5},8]
[null,null,"TPCC Team Score",{"$f":"SUM(H7:H17)+H19","v":0},null,9]
[null,null,"TPCC Team Wickets",{"$f":"SUM(I7:I17)","v":0},null,10]
[{"$nulls":5},11]
[null,null,"Opposition Team Score",{"$f":"SUM(K24:K34)+H36","v":0}]
[null,null,"Opposition Team Wickets",{"$f":"SUM(J24:J34)","v":0},null,"Batting Extras"]
[]
[null,null,"TPCC Overs Bowled",{"$f":"SUM(H24:H34)","v":0}]
[null,null,"Opposition Overs Bowled",null,null,"Bowling"]
[{"$nulls":5},"Position","Name","Overs","Maidens","Wickets","Runs"]
[null,null,"TPCC Captain",null,null,1]
[{"$nulls":5},2]
[{"$nulls":5},3]
[{"$nulls":5},4]
[{"$nulls":5},5]
[{"$nulls":5},6]
[{"$nulls":5},7]
[{"$nulls":5},8]
[{"$nulls":5},9]
[{"$nulls":5},10]
[{"$nulls":5},11]
[]
[{"$nulls":5},"Bowling Extras"]

{"sheet":"Greys Green (1)","index":8,"n_rows":36,"n_cols":39,"rows_kept":36,"merged":[[2,2,2,10],[4,5,4,8],[21,5,21,10]]}
[]
[{"$nulls":13},"Date","Opposition","Match Status","Home/Away","Captain","TPCC Batting First","TPCC Team Score","TPCC Team Wickets","Opposition Team Score","Opposition Team Wickets","TPCC Overs Bowled","TPCC Overs Faced","Batting Extras","Bowling Extras","Batsmen Position","Batsmen Name","Batsmen Runs","Batsmen Out",50,100,"Bowler Position","Bowler Name","Bowler Overs","Bowler Maidens","Bowler Wickets","Bowler Runs"]
[null,null,"Match Overview",{"$nulls":10},{"$f":"$D$5","v":41041},{"$f":"$D$7","v":"Greys Green (1)"},{"$f":"$D$9","v":"Cancelled (Rain)"},{"$f":"$D$11","v":"Home"},{"$f":"$D$24","v":0},{"$f":"$D$13","v":0},{"$f":"$D$15","v":0},{"$f":"$D$16","v":0},{"$f":"$D$18","v":0},{"$f":"$D$19","v":0},{"$f":"$D$21","v":0},{"$f":"$D$22","v":0},{"$f":"$H$19","v":0},{"$f":"$H$36","v":0},{"$f":"F7","v":1},{"$f":"G7","v":0},{"$f":"H7","v":0},{"$f":"I7","v":0},{"$f":"(IF(AD3>49,1,0))-AG3","v":0},{"$f":"IF(AD3>99,1,0)","v":0},{"$f":"F24","v":1},{"$f":"G24","v":0},0,0,0,0]
[{"$nulls":13},41041,"Greys Green (1)","Cancelled (Rain)","Home",{"$f":"$D$24","v":0},0,0,0,0,0,0,0,0,0,{"$f":"F8","v":2},0,0,0,{"$f":"(IF(AD4>49,1,0))-AG4","v":0},{"$f":"IF(AD4>99,1,0)","v":0},{"$f":"F25","v":2},0,0,0,0,0]
[null,null,"Date","2012-05-12",null,"Batting ",{"$nulls":7},41041,"Greys Green (1)","Cancelled (Rain)","Home",0,0,0,0,0,0,0,0,0,0,3,0,0,0,0,0,3,0,0,0,0,0]
[{"$nulls":5},"Position","Name","Runs","Out",{"$nulls":4},41041,"Greys Green (1)","Cancelled (Rain)","Home",0,0,0,0,0,0,0,0,0,0,4,0,0,0,0,0,4,0,0,0,0,0]
[null,null,"Opposition","Greys Green (1)",null,1,{"$nulls":7},41041,"Greys Green (1)","Cancelled (Rain)","Home",0,0,0,0,0,0,0,0,0,0,5,0,0,0,0,0,5,0,0,0,0,0]
[{"$nulls":5},2,{"$nulls":7},41041,"Greys Green (1)","Cancelled (Rain)","Home",0,0,0,0,0,0,0,0,0,0,6,0,0,0,0,0,6,0,0,0,0,0]
[null,null,"Match Status","Cancelled (Rain)",null,3,{"$nulls":7},41041,"Greys Green (1)","Cancelled (Rain)","Home",0,0,0,0,0,0,0,0,0,0,7,0,0,0,0,0,7,0,0,0,0,0]
[{"$nulls":5},4,{"$nulls":7},41041,"Greys Green (1)","Cancelled (Rain)","Home",0,0,0,0,0,0,0,0,0,0,8,0,0,0,0,0,8,0,0,0,0,0]
[null,null,"Home / Away","Home",null,5,{"$nulls":7},41041,"Greys Green (1)","Cancelled (Rain)","Home",0,0,0,0,0,0,0,0,0,0,9,0,0,0,0,0,9,0,0,0,0,0]
[{"$nulls":5},6,{"$nulls":7},41041,"Greys Green (1)","Cancelled (Rain)","Home",0,0,0,0,0,0,0,0,0,0,10,0,0,0,0,0,10,0,0,0,0,0]
[null,null,"TPCC Batting First",null,null,7,{"$nulls":7},41041,"Greys Green (1)","Cancelled (Rain)","Home",0,0,0,0,0,0,0,0,0,0,11,0,0,0,0,0,11,0,0,0,0,0]
[{"$nulls":5},8]
[null,null,"TPCC Team Score",{"$f":"SUM(H7:H17)+H19","v":0},null,9]
[null,null,"TPCC Team Wickets",{"$f":"SUM(I7:I17)","v":0},null,10]
[{"$nulls":5},11]
[null,null,"Opposition Team Score",{"$f":"SUM(K24:K34)+H36","v":0}]
[null,null,"Opposition Team Wickets",{"$f":"SUM(J24:J34)","v":0},null,"Batting Extras"]
[]
[null,null,"TPCC Overs Bowled",{"$f":"SUM(H24:H34)","v":0}]
[null,null,"Opposition Overs Bowled",null,null,"Bowling"]
[{"$nulls":5},"Position","Name","Overs","Maidens","Wickets","Runs"]
[null,null,"TPCC Captain",null,null,1]
[{"$nulls":5},2]
[{"$nulls":5},3]
[{"$nulls":5},4]
[{"$nulls":5},5]
[{"$nulls":5},6]
[{"$nulls":5},7]
[{"$nulls":5},8]
[{"$nulls":5},9]
[{"$nulls":5},10]
[{"$nulls":5},11]
[]
[{"$nulls":5},"Bowling Extras"]

{"sheet":"Crazies Hill & Cockpole Green","index":9,"n_rows":36,"n_cols":39,"rows_kept":36,"merged":[[2,2,2,10],[4,5,4,8],[21,5,21,10]]}
[]
[{"$nulls":13},"Date","Opposition","Match Status","Home/Away","Captain","TPCC Batting First","TPCC Team Score","TPCC Team Wickets","Opposition Team Score","Opposition Team Wickets","TPCC Overs Bowled","TPCC Overs Faced","Batting Extras","Bowling Extras","Batsmen Position","Batsmen Name","Batsmen Runs","Batsmen Out",50,100,"Bowler Position","Bowler Name","Bowler Overs","Bowler Maidens","Bowler Wickets","Bowler Runs"]
[null,null,"Match Overview",{"$nulls":10},{"$f":"$D$5","v":41048},{"$f":"$D$7","v":"Crazies Hill"},{"$f":"$D$9","v":"Win"},{"$f":"$D$11","v":"Home"},{"$f":"$D$24","v":"T. White"},{"$f":"$D$13","v":"Second"},{"$f":"$D$15","v":178},{"$f":"$D$16","v":6},{"$f":"$D$18","v":177},{"$f":"$D$19","v":3},{"$f":"$D$21","v":49},{"$f":"$D$22","v":36},{"$f":"$H$19","v":6},{"$f":"$H$36","v":6},{"$f":"F7","v":1},{"$f":"G7","v":"C. Simon"},{"$f":"H7","v":5},{"$f":"I7","v":1},{"$f":"(IF(AD3>49,1,0))-AG3","v":0},{"$f":"IF(AD3>99,1,0)","v":0},{"$f":"F24","v":1},{"$f":"G24","v":"N. Henry"},9,3,0,19]
[{"$nulls":13},41048,"Crazies Hill","Win","Home",{"$f":"$D$24","v":"T. White"},"Second",178,6,177,3,49,36,6,6,{"$f":"F8","v":2},"S. Halfhead",13,1,{"$f":"(IF(AD4>49,1,0))-AG4","v":0},{"$f":"IF(AD4>99,1,0)","v":0},{"$f":"F25","v":2},"T. White",7,2,0,10]
[null,null,"Date","2012-05-19",null,"Batting ",{"$nulls":7},41048,"Crazies Hill","Win","Home","T. White","Second",178,6,177,3,49,36,6,6,3,"J. Hunt",80,0,1,0,3,"J. Hunt",11,2,0,26]
[{"$nulls":5},"Position","Name","Runs","Out",{"$nulls":4},41048,"Crazies Hill","Win","Home","T. White","Second",178,6,177,3,49,36,6,6,4,"R. Gunn",16,1,0,0,4,"M. Kemp",12,1,1,62]
[null,null,"Opposition","Crazies Hill",null,1,"C. Simon",5,1,{"$nulls":4},41048,"Crazies Hill","Win","Home","T. White","Second",178,6,177,3,49,36,6,6,5,"Ro. Dickie",33,1,0,0,5,"J. Reid",2,0,0,19]
[{"$nulls":5},2,"S. Halfhead",13,1,{"$nulls":4},41048,"Crazies Hill","Win","Home","T. White","Second",178,6,177,3,49,36,6,6,6,"J. Reid",0,1,0,0,6,"S. Halfhead",6,0,1,21]
[null,null,"Match Status","Win",null,3,"J. Hunt",80,0,{"$nulls":4},41048,"Crazies Hill","Win","Home","T. White","Second",178,6,177,3,49,36,6,6,7,"N. Henry",20,1,0,0,7,"Ro. Dickie",2,0,1,14]
[{"$nulls":5},4,"R. Gunn",16,1,{"$nulls":4},41048,"Crazies Hill","Win","Home","T. White","Second",178,6,177,3,49,36,6,6,8,"M. Kemp",5,0,0,0,8,0,0,0,0,0]
[null,null,"Home / Away","Home",null,5,"Ro. Dickie",33,1,{"$nulls":4},41048,"Crazies Hill","Win","Home","T. White","Second",178,6,177,3,49,36,6,6,9,0,0,0,0,0,9,0,0,0,0,0]
[{"$nulls":5},6,"J. Reid",0,1,{"$nulls":4},41048,"Crazies Hill","Win","Home","T. White","Second",178,6,177,3,49,36,6,6,10,0,0,0,0,0,10,0,0,0,0,0]
[null,null,"TPCC Batting First","Second",null,7,"N. Henry",20,1,{"$nulls":4},41048,"Crazies Hill","Win","Home","T. White","Second",178,6,177,3,49,36,6,6,11,0,0,0,0,0,11,0,0,0,0,0]
[{"$nulls":5},8,"M. Kemp",5,0]
[null,null,"TPCC Team Score",{"$f":"SUM(H7:H17)+H19","v":178},null,9]
[null,null,"TPCC Team Wickets",{"$f":"SUM(I7:I17)","v":6},null,10]
[{"$nulls":5},11]
[null,null,"Opposition Team Score",{"$f":"SUM(K24:K34)+H36","v":177}]
[null,null,"Opposition Team Wickets",{"$f":"SUM(J24:J34)","v":3},null,"Batting Extras",null,6]
[]
[null,null,"TPCC Overs Bowled",{"$f":"SUM(H24:H34)","v":49}]
[null,null,"Opposition Overs Bowled",36,null,"Bowling"]
[{"$nulls":5},"Position","Name","Overs","Maidens","Wickets","Runs"]
[null,null,"TPCC Captain","T. White",null,1,"N. Henry",9,3,0,19]
[{"$nulls":5},2,"T. White",7,2,0,10]
[{"$nulls":5},3,"J. Hunt",11,2,0,26]
[{"$nulls":5},4,"M. Kemp",12,1,1,62]
[{"$nulls":5},5,"J. Reid",2,0,0,19]
[{"$nulls":5},6,"S. Halfhead",6,0,1,21]
[{"$nulls":5},7,"Ro. Dickie",2,0,1,14]
[{"$nulls":5},8]
[{"$nulls":5},9]
[{"$nulls":5},10]
[{"$nulls":5},11]
[]
[{"$nulls":5},"Bowling Extras",null,6]

{"sheet":"Britwell Salome","index":10,"n_rows":36,"n_cols":39,"rows_kept":36,"merged":[[2,2,2,10],[4,5,4,8],[21,5,21,10]]}
[]
[{"$nulls":13},"Date","Opposition","Match Status","Home/Away","Captain","TPCC Batting First","TPCC Team Score","TPCC Team Wickets","Opposition Team Score","Opposition Team Wickets","TPCC Overs Bowled","TPCC Overs Faced","Batting Extras","Bowling Extras","Batsmen Position","Batsmen Name","Batsmen Runs","Batsmen Out",50,100,"Bowler Position","Bowler Name","Bowler Overs","Bowler Maidens","Bowler Wickets","Bowler Runs"]
[null,null,"Match Overview",{"$nulls":10},{"$f":"$D$5","v":41049},{"$f":"$D$7","v":"Britwell Salome"},{"$f":"$D$9","v":"Draw"},{"$f":"$D$11","v":"Home"},{"$f":"$D$24","v":"S. Beardall"},{"$f":"$D$13","v":"First"},{"$f":"$D$15","v":217},{"$f":"$D$16","v":3},{"$f":"$D$18","v":163},{"$f":"$D$19","v":3},{"$f":"$D$21","v":39},{"$f":"$D$22","v":34},{"$f":"$H$19","v":7},{"$f":"$H$36","v":1},{"$f":"F7","v":1},{"$f":"G7","v":"S. Beardall"},{"$f":"H7","v":60},{"$f":"I7","v":1},{"$f":"(IF(AD3>49,1,0))-AG3","v":1},{"$f":"IF(AD3>99,1,0)","v":0},{"$f":"F24","v":1},{"$f":"G24","v":"T. White"},9,2,1,22]
[{"$nulls":13},41049,"Britwell Salome","Draw","Home",{"$f":"$D$24","v":"S. Beardall"},"First",217,3,163,3,39,34,7,1,{"$f":"F8","v":2},"J. Moberly",3,1,{"$f":"(IF(AD4>49,1,0))-AG4","v":0},{"$f":"IF(AD4>99,1,0)","v":0},{"$f":"F25","v":2},"P. Girdler",5,3,1,3]
[null,null,"Date","2012-05-20",null,"Batting ",{"$nulls":7},41049,"Britwell Salome","Draw","Home","S. Beardall","First",217,3,163,3,39,34,7,1,3,"J. Hancock",99,0,1,0,3,"N. Henry",7,0,0,45]
[{"$nulls":5},"Position","Name","Runs","Out",{"$nulls":4},41049,"Britwell Salome","Draw","Home","S. Beardall","First",217,3,163,3,39,34,7,1,4,"D. Stockings",41,1,0,0,4,"J. Hunt",6,1,0,34]
[null,null,"Opposition","Britwell Salome",null,1,"S. Beardall",60,1,{"$nulls":4},41049,"Britwell Salome","Draw","Home","S. Beardall","First",217,3,163,3,39,34,7,1,5,"P. Girdler",7,0,0,0,5,"J. Hancock",4,0,1,18]
[{"$nulls":5},2,"J. Moberly",3,1,{"$nulls":4},41049,"Britwell Salome","Draw","Home","S. Beardall","First",217,3,163,3,39,34,7,1,6,0,0,0,0,0,6,"C. Henry",5,0,0,21]
[null,null,"Match Status","Draw",null,3,"J. Hancock",99,0,{"$nulls":4},41049,"Britwell Salome","Draw","Home","S. Beardall","First",217,3,163,3,39,34,7,1,7,0,0,0,0,0,7,"D. Stockings",2,0,0,19]
[{"$nulls":5},4,"D. Stockings",41,1,{"$nulls":4},41049,"Britwell Salome","Draw","Home","S. Beardall","First",217,3,163,3,39,34,7,1,8,0,0,0,0,0,8,"J. Moberly",1,1,0,0]
[null,null,"Home / Away","Home",null,5,"P. Girdler",7,0,{"$nulls":4},41049,"Britwell Salome","Draw","Home","S. Beardall","First",217,3,163,3,39,34,7,1,9,0,0,0,0,0,9,0,0,0,0,0]
[{"$nulls":5},6,{"$nulls":7},41049,"Britwell Salome","Draw","Home","S. Beardall","First",217,3,163,3,39,34,7,1,10,0,0,0,0,0,10,0,0,0,0,0]
[null,null,"TPCC Batting First","First",null,7,{"$nulls":7},41049,"Britwell Salome","Draw","Home","S. Beardall","First",217,3,163,3,39,34,7,1,11,0,0,0,0,0,11,0,0,0,0,0]
[{"$nulls":5},8]
[null,null,"TPCC Team Score",{"$f":"SUM(H7:H17)+H19","v":217},null,9]
[null,null,"TPCC Team Wickets",{"$f":"SUM(I7:I17)","v":3},null,10]
[{"$nulls":5},11]
[null,null,"Opposition Team Score",{"$f":"SUM(K24:K34)+H36","v":163}]
[null,null,"Opposition Team Wickets",{"$f":"SUM(J24:J34)","v":3},null,"Batting Extras",null,7]
[]
[null,null,"TPCC Overs Bowled",{"$f":"SUM(H24:H34)","v":39}]
[null,null,"Opposition Overs Bowled",34,null,"Bowling"]
[{"$nulls":5},"Position","Name","Overs","Maidens","Wickets","Runs"]
[null,null,"TPCC Captain","S. Beardall",null,1,"T. White",9,2,1,22]
[{"$nulls":5},2,"P. Girdler",5,3,1,3]
[{"$nulls":5},3,"N. Henry",7,0,0,45]
[{"$nulls":5},4,"J. Hunt",6,1,0,34]
[{"$nulls":5},5,"J. Hancock",4,0,1,18]
[{"$nulls":5},6,"C. Henry",5,0,0,21]
[{"$nulls":5},7,"D. Stockings",2,0,0,19]
[{"$nulls":5},8,"J. Moberly",1,1,0,0]
[{"$nulls":5},9]
[{"$nulls":5},10]
[{"$nulls":5},11]
[]
[{"$nulls":5},"Bowling Extras",null,1]

{"sheet":"Harpsden (1)","index":11,"n_rows":36,"n_cols":39,"rows_kept":36,"merged":[[2,2,2,10],[4,5,4,8],[21,5,21,10]]}
[]
[{"$nulls":13},"Date","Opposition","Match Status","Home/Away","Captain","TPCC Batting First","TPCC Team Score","TPCC Team Wickets","Opposition Team Score","Opposition Team Wickets","TPCC Overs Bowled","TPCC Overs Faced","Batting Extras","Bowling Extras","Batsmen Position","Batsmen Name","Batsmen Runs","Batsmen Out",50,100,"Bowler Position","Bowler Name","Bowler Overs","Bowler Maidens","Bowler Wickets","Bowler Runs"]
[null,null,"Match Overview",{"$nulls":10},{"$f":"$D$5","v":41055},{"$f":"$D$7","v":"Harpsden (1)"},{"$f":"$D$9","v":"Loss"},{"$f":"$D$11","v":"Away"},{"$f":"$D$24","v":"J. Hunt"},{"$f":"$D$13","v":"First"},{"$f":"$D$15","v":150},{"$f":"$D$16","v":10},{"$f":"$D$18","v":151},{"$f":"$D$19","v":7},{"$f":"$D$21","v":33},{"$f":"$D$22","v":38},{"$f":"$H$19","v":16},{"$f":"$H$36","v":25},{"$f":"F7","v":1},{"$f":"G7","v":"C. Simon"},{"$f":"H7","v":21},{"$f":"I7","v":1},{"$f":"(IF(AD3>49,1,0))-AG3","v":0},{"$f":"IF(AD3>99,1,0)","v":0},{"$f":"F24","v":1},{"$f":"G24","v":"N. Henry"},9,2,0,36]
[{"$nulls":13},41055,"Harpsden (1)","Loss","Away",{"$f":"$D$24","v":"J. Hunt"},"First",150,10,151,7,33,38,16,25,{"$f":"F8","v":2},"Ro. Dickie",26,1,{"$f":"(IF(AD4>49,1,0))-AG4","v":0},{"$f":"IF(AD4>99,1,0)","v":0},{"$f":"F25","v":2},"J. Hunt",8,0,2,27]
[null,null,"Date","2012-05-26",null,"Batting ",{"$nulls":7},41055,"Harpsden (1)","Loss","Away","J. Hunt","First",150,10,151,7,33,38,16,25,3,"S. Bucknill",5,1,0,0,3,"N. Runkel",6,0,3,21]
[{"$nulls":5},"Position","Name","Runs","Out",{"$nulls":4},41055,"Harpsden (1)","Loss","Away","J. Hunt","First",150,10,151,7,33,38,16,25,4,"J. Hunt",53,1,1,0,4,"C. Henry",7,0,2,28]
[null,null,"Opposition","Harpsden (1)",null,1,"C. Simon",21,1,{"$nulls":4},41055,"Harpsden (1)","Loss","Away","J. Hunt","First",150,10,151,7,33,38,16,25,5,"P. Briffett",0,1,0,0,5,"Ra. Dickie",2,0,0,5]
[{"$nulls":5},2,"Ro. Dickie",26,1,{"$nulls":4},41055,"Harpsden (1)","Loss","Away","J. Hunt","First",150,10,151,7,33,38,16,25,6,"J. Moberly",4,1,0,0,6,"P. Briffett",1,0,0,9]
[null,null,"Match Status","Loss",null,3,"S. Bucknill",5,1,{"$nulls":4},41055,"Harpsden (1)","Loss","Away","J. Hunt","First",150,10,151,7,33,38,16,25,7,"D. Mackey",0,1,0,0,7,0,0,0,0,0]
[{"$nulls":5},4,"J. Hunt",53,1,{"$nulls":4},41055,"Harpsden (1)","Loss","Away","J. Hunt","First",150,10,151,7,33,38,16,25,8,"N. Runkel",7,1,0,0,8,0,0,0,0,0]
[null,null,"Home / Away","Away",null,5,"P. Briffett",0,1,{"$nulls":4},41055,"Harpsden (1)","Loss","Away","J. Hunt","First",150,10,151,7,33,38,16,25,9,"C. Henry",5,0,0,0,9,0,0,0,0,0]
[{"$nulls":5},6,"J. Moberly",4,1,{"$nulls":4},41055,"Harpsden (1)","Loss","Away","J. Hunt","First",150,10,151,7,33,38,16,25,10,"Ra. Dickie",4,1,0,0,10,0,0,0,0,0]
[null,null,"TPCC Batting First","First",null,7,"D. Mackey",0,1,{"$nulls":4},41055,"Harpsden (1)","Loss","Away","J. Hunt","First",150,10,151,7,33,38,16,25,11,"N. Henry",9,1,0,0,11,0,0,0,0,0]
[{"$nulls":5},8,"N. Runkel",7,1]
[null,null,"TPCC Team Score",{"$f":"SUM(H7:H17)+H19","v":150},null,9,"C. Henry",5,0]
[null,null,"TPCC Team Wickets",{"$f":"SUM(I7:I17)","v":10},null,10,"Ra. Dickie",4,1]
[{"$nulls":5},11,"N. Henry",9,1]
[null,null,"Opposition Team Score",{"$f":"SUM(K24:K34)+H36","v":151}]
[null,null,"Opposition Team Wickets",{"$f":"SUM(J24:J34)","v":7},null,"Batting Extras",null,16]
[]
[null,null,"TPCC Overs Bowled",{"$f":"SUM(H24:H34)","v":33}]
[null,null,"Opposition Overs Bowled",38,null,"Bowling"]
[{"$nulls":5},"Position","Name","Overs","Maidens","Wickets","Runs"]
[null,null,"TPCC Captain","J. Hunt",null,1,"N. Henry",9,2,0,36]
[{"$nulls":5},2,"J. Hunt",8,0,2,27]
[{"$nulls":5},3,"N. Runkel",6,0,3,21]
[{"$nulls":5},4,"C. Henry",7,0,2,28]
[{"$nulls":5},5,"Ra. Dickie",2,0,0,5]
[{"$nulls":5},6,"P. Briffett",1,0,0,9]
[{"$nulls":5},7]
[{"$nulls":5},8]
[{"$nulls":5},9]
[{"$nulls":5},10]
[{"$nulls":5},11]
[]
[{"$nulls":5},"Bowling Extras",null,25]

{"sheet":"Checkendon (1)","index":12,"n_rows":36,"n_cols":39,"rows_kept":36,"merged":[[2,2,2,10],[4,5,4,8],[21,5,21,10]]}
[]
[{"$nulls":13},"Date","Opposition","Match Status","Home/Away","Captain","TPCC Batting First","TPCC Team Score","TPCC Team Wickets","Opposition Team Score","Opposition Team Wickets","TPCC Overs Bowled","TPCC Overs Faced","Batting Extras","Bowling Extras","Batsmen Position","Batsmen Name","Batsmen Runs","Batsmen Out",50,100,"Bowler Position","Bowler Name","Bowler Overs","Bowler Maidens","Bowler Wickets","Bowler Runs"]
[null,null,"Match Overview",{"$nulls":10},{"$f":"$D$5","v":41056},{"$f":"$D$7","v":"Checkendon (1)"},{"$f":"$D$9","v":"Win"},{"$f":"$D$11","v":"Home"},{"$f":"$D$24","v":"J. Hancock"},{"$f":"$D$13","v":"Second"},{"$f":"$D$15","v":174},{"$f":"$D$16","v":8},{"$f":"$D$18","v":173},{"$f":"$D$19","v":9},{"$f":"$D$21","v":45},{"$f":"$D$22","v":40},{"$f":"$H$19","v":16},{"$f":"$H$36","v":7},{"$f":"F7","v":1},{"$f":"G7","v":"O. Brett"},{"$f":"H7","v":3},{"$f":"I7","v":1},{"$f":"(IF(AD3>49,1,0))-AG3","v":0},{"$f":"IF(AD3>99,1,0)","v":0},{"$f":"F24","v":1},{"$f":"G24","v":"N. Henry"},18,6,3,52]
[{"$nulls":13},41056,"Checkendon (1)","Win","Home",{"$f":"$D$24","v":"J. Hancock"},"Second",174,8,173,9,45,40,16,7,{"$f":"F8","v":2},"T. Wade",0,1,{"$f":"(IF(AD4>49,1,0))-AG4","v":0},{"$f":"IF(AD4>99,1,0)","v":0},{"$f":"F25","v":2},"H. De Zulueta",5,0,2,29]
[null,null,"Date","2012-05-27",null,"Batting ",{"$nulls":7},41056,"Checkendon (1)","Win","Home","J. Hancock","Second",174,8,173,9,45,40,16,7,3,"R. Gunn",13,1,0,0,3,"J. Kleiner-Mann",3,0,1,6]
[{"$nulls":5},"Position","Name","Runs","Out",{"$nulls":4},41056,"Checkendon (1)","Win","Home","J. Hancock","Second",174,8,173,9,45,40,16,7,4,"J. Kleiner-Mann",1,1,0,0,4,"C. Henry",7,0,0,25]
[null,null,"Opposition","Checkendon (1)",null,1,"O. Brett",3,1,{"$nulls":4},41056,"Checkendon (1)","Win","Home","J. Hancock","Second",174,8,173,9,45,40,16,7,5,"J. Hancock",101,0,0,1,5,"J. Leefe",6,0,1,14]
[{"$nulls":5},2,"T. Wade",0,1,{"$nulls":4},41056,"Checkendon (1)","Win","Home","J. Hancock","Second",174,8,173,9,45,40,16,7,6,"J. Leefe",13,1,0,0,6,"O. Brett",3,0,1,31]
[null,null,"Match Status","Win",null,3,"R. Gunn",13,1,{"$nulls":4},41056,"Checkendon (1)","Win","Home","J. Hancock","Second",174,8,173,9,45,40,16,7,7,"J. Moberly",14,1,0,0,7,"J. Moberly",3,0,1,9]
[{"$nulls":5},4,"J. Kleiner-Mann",1,1,{"$nulls":4},41056,"Checkendon (1)","Win","Home","J. Hancock","Second",174,8,173,9,45,40,16,7,8,"H. De Zulueta",6,1,0,0,8,0,0,0,0,0]
[null,null,"Home / Away","Home",null,5,"J. Hancock",101,0,{"$nulls":4},41056,"Checkendon (1)","Win","Home","J. Hancock","Second",174,8,173,9,45,40,16,7,9,"C. Henry",2,1,0,0,9,0,0,0,0,0]
[{"$nulls":5},6,"J. Leefe",13,1,{"$nulls":4},41056,"Checkendon (1)","Win","Home","J. Hancock","Second",174,8,173,9,45,40,16,7,10,"N. Henry",5,0,0,0,10,0,0,0,0,0]
[null,null,"TPCC Batting First","Second",null,7,"J. Moberly",14,1,{"$nulls":4},41056,"Checkendon (1)","Win","Home","J. Hancock","Second",174,8,173,9,45,40,16,7,11,0,0,0,0,0,11,0,0,0,0,0]
[{"$nulls":5},8,"H. De Zulueta",6,1]
[null,null,"TPCC Team Score",{"$f":"SUM(H7:H17)+H19","v":174},null,9,"C. Henry",2,1]
[null,null,"TPCC Team Wickets",{"$f":"SUM(I7:I17)","v":8},null,10,"N. Henry",5,0]
[{"$nulls":5},11]
[null,null,"Opposition Team Score",{"$f":"SUM(K24:K34)+H36","v":173}]
[null,null,"Opposition Team Wickets",{"$f":"SUM(J24:J34)","v":9},null,"Batting Extras",null,16]
[]
[null,null,"TPCC Overs Bowled",{"$f":"SUM(H24:H34)","v":45}]
[null,null,"Opposition Overs Bowled",40,null,"Bowling"]
[{"$nulls":5},"Position","Name","Overs","Maidens","Wickets","Runs"]
[null,null,"TPCC Captain","J. Hancock",null,1,"N. Henry",18,6,3,52]
[{"$nulls":5},2,"H. De Zulueta",5,0,2,29]
[{"$nulls":5},3,"J. Kleiner-Mann",3,0,1,6]
[{"$nulls":5},4,"C. Henry",7,0,0,25]
[{"$nulls":5},5,"J. Leefe",6,0,1,14]
[{"$nulls":5},6,"O. Brett",3,0,1,31]
[{"$nulls":5},7,"J. Moberly",3,0,1,9]
[{"$nulls":5},8]
[{"$nulls":5},9]
[{"$nulls":5},10]
[{"$nulls":5},11]
[]
[{"$nulls":5},"Bowling Extras",null,7]

{"sheet":"Cuxham","index":13,"n_rows":36,"n_cols":39,"rows_kept":36,"merged":[[2,2,2,10],[4,5,4,8],[21,5,21,10]]}
[]
[{"$nulls":13},"Date","Opposition","Match Status","Home/Away","Captain","TPCC Batting First","TPCC Team Score","TPCC Team Wickets","Opposition Team Score","Opposition Team Wickets","TPCC Overs Bowled","TPCC Overs Faced","Batting Extras","Bowling Extras","Batsmen Position","Batsmen Name","Batsmen Runs","Batsmen Out",50,100,"Bowler Position","Bowler Name","Bowler Overs","Bowler Maidens","Bowler Wickets","Bowler Runs"]
[null,null,"Match Overview",{"$nulls":10},{"$f":"$D$5","v":41063},{"$f":"$D$7","v":"Cuxham"},{"$f":"$D$9","v":"Cancelled (Rain)"},{"$f":"$D$11","v":"Home"},{"$f":"$D$24","v":0},{"$f":"$D$13","v":0},{"$f":"$D$15","v":0},{"$f":"$D$16","v":0},{"$f":"$D$18","v":0},{"$f":"$D$19","v":0},{"$f":"$D$21","v":0},{"$f":"$D$22","v":0},{"$f":"$H$19","v":0},{"$f":"$H$36","v":0},{"$f":"F7","v":1},{"$f":"G7","v":0},{"$f":"H7","v":0},{"$f":"I7","v":0},{"$f":"(IF(AD3>49,1,0))-AG3","v":0},{"$f":"IF(AD3>99,1,0)","v":0},{"$f":"F24","v":1},{"$f":"G24","v":0},0,0,0,0]
[{"$nulls":13},41063,"Cuxham","Cancelled (Rain)","Home",{"$f":"$D$24","v":0},0,0,0,0,0,0,0,0,0,{"$f":"F8","v":2},0,0,0,{"$f":"(IF(AD4>49,1,0))-AG4","v":0},{"$f":"IF(AD4>99,1,0)","v":0},{"$f":"F25","v":2},0,0,0,0,0]
[null,null,"Date","2012-06-03",null,"Batting ",{"$nulls":7},41063,"Cuxham","Cancelled (Rain)","Home",0,0,0,0,0,0,0,0,0,0,3,0,0,0,0,0,3,0,0,0,0,0]
[{"$nulls":5},"Position","Name","Runs","Out",{"$nulls":4},41063,"Cuxham","Cancelled (Rain)","Home",0,0,0,0,0,0,0,0,0,0,4,0,0,0,0,0,4,0,0,0,0,0]
[null,null,"Opposition","Cuxham",null,1,{"$nulls":7},41063,"Cuxham","Cancelled (Rain)","Home",0,0,0,0,0,0,0,0,0,0,5,0,0,0,0,0,5,0,0,0,0,0]
[{"$nulls":5},2,{"$nulls":7},41063,"Cuxham","Cancelled (Rain)","Home",0,0,0,0,0,0,0,0,0,0,6,0,0,0,0,0,6,0,0,0,0,0]
[null,null,"Match Status","Cancelled (Rain)",null,3,{"$nulls":7},41063,"Cuxham","Cancelled (Rain)","Home",0,0,0,0,0,0,0,0,0,0,7,0,0,0,0,0,7,0,0,0,0,0]
[{"$nulls":5},4,{"$nulls":7},41063,"Cuxham","Cancelled (Rain)","Home",0,0,0,0,0,0,0,0,0,0,8,0,0,0,0,0,8,0,0,0,0,0]
[null,null,"Home / Away","Home",null,5,{"$nulls":7},41063,"Cuxham","Cancelled (Rain)","Home",0,0,0,0,0,0,0,0,0,0,9,0,0,0,0,0,9,0,0,0,0,0]
[{"$nulls":5},6,{"$nulls":7},41063,"Cuxham","Cancelled (Rain)","Home",0,0,0,0,0,0,0,0,0,0,10,0,0,0,0,0,10,0,0,0,0,0]
[null,null,"TPCC Batting First",null,null,7,{"$nulls":7},41063,"Cuxham","Cancelled (Rain)","Home",0,0,0,0,0,0,0,0,0,0,11,0,0,0,0,0,11,0,0,0,0,0]
[{"$nulls":5},8]
[null,null,"TPCC Team Score",{"$f":"SUM(H7:H17)+H19","v":0},null,9]
[null,null,"TPCC Team Wickets",{"$f":"SUM(I7:I17)","v":0},null,10]
[{"$nulls":5},11]
[null,null,"Opposition Team Score",{"$f":"SUM(K24:K34)+H36","v":0}]
[null,null,"Opposition Team Wickets",{"$f":"SUM(J24:J34)","v":0},null,"Batting Extras"]
[]
[null,null,"TPCC Overs Bowled",{"$f":"SUM(H24:H34)","v":0}]
[null,null,"Opposition Overs Bowled",null,null,"Bowling"]
[{"$nulls":5},"Position","Name","Overs","Maidens","Wickets","Runs"]
[null,null,"TPCC Captain",null,null,1]
[{"$nulls":5},2]
[{"$nulls":5},3]
[{"$nulls":5},4]
[{"$nulls":5},5]
[{"$nulls":5},6]
[{"$nulls":5},7]
[{"$nulls":5},8]
[{"$nulls":5},9]
[{"$nulls":5},10]
[{"$nulls":5},11]
[]
[{"$nulls":5},"Bowling Extras"]

{"sheet":"Privateers","index":14,"n_rows":36,"n_cols":39,"rows_kept":36,"merged":[[2,2,2,10],[4,5,4,8],[21,5,21,10]]}
[]
[{"$nulls":13},"Date","Opposition","Match Status","Home/Away","Captain","TPCC Batting First","TPCC Team Score","TPCC Team Wickets","Opposition Team Score","Opposition Team Wickets","TPCC Overs Bowled","TPCC Overs Faced","Batting Extras","Bowling Extras","Batsmen Position","Batsmen Name","Batsmen Runs","Batsmen Out",50,100,"Bowler Position","Bowler Name","Bowler Overs","Bowler Maidens","Bowler Wickets","Bowler Runs"]
[null,null,"Match Overview",{"$nulls":10},{"$f":"$D$5","v":41069},{"$f":"$D$7","v":"Privateers"},{"$f":"$D$9","v":"Draw"},{"$f":"$D$11","v":"Home"},{"$f":"$D$24","v":"J. Hunt"},{"$f":"$D$13","v":"Second"},{"$f":"$D$15","v":113},{"$f":"$D$16","v":8},{"$f":"$D$18","v":163},{"$f":"$D$19","v":7},{"$f":"$D$21","v":49},{"$f":"$D$22","v":41},{"$f":"$H$19","v":8},{"$f":"$H$36","v":9},{"$f":"F7","v":1},{"$f":"G7","v":"Ro. Dickie"},{"$f":"H7","v":2},{"$f":"I7","v":1},{"$f":"(IF(AD3>49,1,0))-AG3","v":0},{"$f":"IF(AD3>99,1,0)","v":0},{"$f":"F24","v":1},{"$f":"G24","v":"N. Henry"},8,2,1,27]
[{"$nulls":13},41069,"Privateers","Draw","Home",{"$f":"$D$24","v":"J. Hunt"},"Second",113,8,163,7,49,41,8,9,{"$f":"F8","v":2},"J. Moberly",9,1,{"$f":"(IF(AD4>49,1,0))-AG4","v":0},{"$f":"IF(AD4>99,1,0)","v":0},{"$f":"F25","v":2},"J. Hunt",6,4,1,6]
[null,null,"Date","2012-06-09",null,"Batting ",{"$nulls":7},41069,"Privateers","Draw","Home","J. Hunt","Second",113,8,163,7,49,41,8,9,3,"J. Hancock",11,1,0,0,3,"O. Thornton",7,0,1,24]
[{"$nulls":5},"Position","Name","Runs","Out",{"$nulls":4},41069,"Privateers","Draw","Home","J. Hunt","Second",113,8,163,7,49,41,8,9,4,"O. Thornton",5,1,0,0,4,"N. Runkel",12,2,2,40]
[null,null,"Opposition","Privateers",null,1,"Ro. Dickie",2,1,{"$nulls":4},41069,"Privateers","Draw","Home","J. Hunt","Second",113,8,163,7,49,41,8,9,5,"P. Briffett",2,1,0,0,5,"J. Thornton",7,2,1,18]
[{"$nulls":5},2,"J. Moberly",9,1,{"$nulls":4},41069,"Privateers","Draw","Home","J. Hunt","Second",113,8,163,7,49,41,8,9,6,"J. Hunt",32,1,0,0,6,"C. Henry",5,0,0,20]
[null,null,"Match Status","Draw",null,3,"J. Hancock",11,1,{"$nulls":4},41069,"Privateers","Draw","Home","J. Hunt","Second",113,8,163,7,49,41,8,9,7,"J. Thornton",2,1,0,0,7,"J. Hancock",4,1,1,19]
[{"$nulls":5},4,"O. Thornton",5,1,{"$nulls":4},41069,"Privateers","Draw","Home","J. Hunt","Second",113,8,163,7,49,41,8,9,8,"N. Henry",40,1,0,0,8,0,0,0,0,0]
[null,null,"Home / Away","Home",null,5,"P. Briffett",2,1,{"$nulls":4},41069,"Privateers","Draw","Home","J. Hunt","Second",113,8,163,7,49,41,8,9,9,"N. Runkel",0,0,0,0,9,0,0,0,0,0]
[{"$nulls":5},6,"J. Hunt",32,1,{"$nulls":4},41069,"Privateers","Draw","Home","J. Hunt","Second",113,8,163,7,49,41,8,9,10,"C. Henry",2,0,0,0,10,0,0,0,0,0]
[null,null,"TPCC Batting First","Second",null,7,"J. Thornton",2,1,{"$nulls":4},41069,"Privateers","Draw","Home","J. Hunt","Second",113,8,163,7,49,41,8,9,11,0,0,0,0,0,11,0,0,0,0,0]
[{"$nulls":5},8,"N. Henry",40,1]
[null,null,"TPCC Team Score",{"$f":"SUM(H7:H17)+H19","v":113},null,9,"N. Runkel",0,0]
[null,null,"TPCC Team Wickets",{"$f":"SUM(I7:I17)","v":8},null,10,"C. Henry",2,0]
[{"$nulls":5},11]
[null,null,"Opposition Team Score",{"$f":"SUM(K24:K34)+H36","v":163}]
[null,null,"Opposition Team Wickets",{"$f":"SUM(J24:J34)","v":7},null,"Batting Extras",null,8]
[]
[null,null,"TPCC Overs Bowled",{"$f":"SUM(H24:H34)","v":49}]
[null,null,"Opposition Overs Bowled",41,null,"Bowling"]
[{"$nulls":5},"Position","Name","Overs","Maidens","Wickets","Runs"]
[null,null,"TPCC Captain","J. Hunt",null,1,"N. Henry",8,2,1,27]
[{"$nulls":5},2,"J. Hunt",6,4,1,6]
[{"$nulls":5},3,"O. Thornton",7,0,1,24]
[{"$nulls":5},4,"N. Runkel",12,2,2,40]
[{"$nulls":5},5,"J. Thornton",7,2,1,18]
[{"$nulls":5},6,"C. Henry",5,0,0,20]
[{"$nulls":5},7,"J. Hancock",4,1,1,19]
[{"$nulls":5},8]
[{"$nulls":5},9]
[{"$nulls":5},10]
[{"$nulls":5},11]
[]
[{"$nulls":5},"Bowling Extras",null,9]

{"sheet":"Invalids","index":15,"n_rows":36,"n_cols":39,"rows_kept":36,"merged":[[2,2,2,10],[4,5,4,8],[21,5,21,10]]}
[]
[{"$nulls":13},"Date","Opposition","Match Status","Home/Away","Captain","TPCC Batting First","TPCC Team Score","TPCC Team Wickets","Opposition Team Score","Opposition Team Wickets","TPCC Overs Bowled","TPCC Overs Faced","Batting Extras","Bowling Extras","Batsmen Position","Batsmen Name","Batsmen Runs","Batsmen Out",50,100,"Bowler Position","Bowler Name","Bowler Overs","Bowler Maidens","Bowler Wickets","Bowler Runs"]
[null,null,"Match Overview",{"$nulls":10},{"$f":"$D$5","v":41076},{"$f":"$D$7","v":"Invalids"},{"$f":"$D$9","v":"Draw"},{"$f":"$D$11","v":"Home"},{"$f":"$D$24","v":"S. Beardall"},{"$f":"$D$13","v":"Second"},{"$f":"$D$15","v":130},{"$f":"$D$16","v":6},{"$f":"$D$18","v":130},{"$f":"$D$19","v":7},{"$f":"$D$21","v":44},{"$f":"$D$22","v":30},{"$f":"$H$19","v":8},{"$f":"$H$36","v":11},{"$f":"F7","v":1},{"$f":"G7","v":"S. Beardall"},{"$f":"H7","v":42},{"$f":"I7","v":1},{"$f":"(IF(AD3>49,1,0))-AG3","v":0},{"$f":"IF(AD3>99,1,0)","v":0},{"$f":"F24","v":1},{"$f":"G24","v":"J. Leefe"},6,0,0,25]
[{"$nulls":13},41076,"Invalids","Draw","Home",{"$f":"$D$24","v":"S. Beardall"},"Second",130,6,130,7,44,30,8,11,{"$f":"F8","v":2},"P. Briffett",6,1,{"$f":"(IF(AD4>49,1,0))-AG4","v":0},{"$f":"IF(AD4>99,1,0)","v":0},{"$f":"F25","v":2},"J. Hunt",4,1,1,5]
[null,null,"Date","2012-06-16",null,"Batting ",{"$nulls":7},41076,"Invalids","Draw","Home","S. Beardall","Second",130,6,130,7,44,30,8,11,3,"T. Wade",18,1,0,0,3,"N. Henry",8,0,0,30]
[{"$nulls":5},"Position","Name","Runs","Out",{"$nulls":4},41076,"Invalids","Draw","Home","S. Beardall","Second",130,6,130,7,44,30,8,11,4,"W. Strickland",8,1,0,0,4,"J. Hancock",9,2,1,8]
[null,null,"Opposition","Invalids",null,1,"S. Beardall",42,1,{"$nulls":4},41076,"Invalids","Draw","Home","S. Beardall","Second",130,6,130,7,44,30,8,11,5,"J. Hunt",13,1,0,0,5,"N. Runkel",9,1,2,18]
[{"$nulls":5},2,"P. Briffett",6,1,{"$nulls":4},41076,"Invalids","Draw","Home","S. Beardall","Second",130,6,130,7,44,30,8,11,6,"C. Simon",7,1,0,0,6,"S. Halfhead",8,1,2,33]
[null,null,"Match Status","Draw",null,3,"T. Wade",18,1,{"$nulls":4},41076,"Invalids","Draw","Home","S. Beardall","Second",130,6,130,7,44,30,8,11,7,"J. Hancock",21,0,0,0,7,"Run Out",0,0,1,0]
[{"$nulls":5},4,"W. Strickland",8,1,{"$nulls":4},41076,"Invalids","Draw","Home","S. Beardall","Second",130,6,130,7,44,30,8,11,8,"J. Leefe",7,0,0,0,8,0,0,0,0,0]
[null,null,"Home / Away","Home",null,5,"J. Hunt",13,1,{"$nulls":4},41076,"Invalids","Draw","Home","S. Beardall","Second",130,6,130,7,44,30,8,11,9,0,0,0,0,0,9,0,0,0,0,0]
[{"$nulls":5},6,"C. Simon",7,1,{"$nulls":4},41076,"Invalids","Draw","Home","S. Beardall","Second",130,6,130,7,44,30,8,11,10,0,0,0,0,0,10,0,0,0,0,0]
[null,null,"TPCC Batting First","Second",null,7,"J. Hancock",21,0,{"$nulls":4},41076,"Invalids","Draw","Home","S. Beardall","Second",130,6,130,7,44,30,8,11,11,0,0,0,0,0,11,0,0,0,0,0]
[{"$nulls":5},8,"J. Leefe",7,0]
[null,null,"TPCC Team Score",{"$f":"SUM(H7:H17)+H19","v":130},null,9]
[null,null,"TPCC Team Wickets",{"$f":"SUM(I7:I17)","v":6},null,10]
[{"$nulls":5},11]
[null,null,"Opposition Team Score",{"$f":"SUM(K24:K34)+H36","v":130}]
[null,null,"Opposition Team Wickets",{"$f":"SUM(J24:J34)","v":7},null,"Batting Extras",null,8]
[]
[null,null,"TPCC Overs Bowled",{"$f":"SUM(H24:H34)","v":44}]
[null,null,"Opposition Overs Bowled",30,null,"Bowling"]
[{"$nulls":5},"Position","Name","Overs","Maidens","Wickets","Runs"]
[null,null,"TPCC Captain","S. Beardall",null,1,"J. Leefe",6,0,0,25]
[{"$nulls":5},2,"J. Hunt",4,1,1,5]
[{"$nulls":5},3,"N. Henry",8,0,0,30]
[{"$nulls":5},4,"J. Hancock",9,2,1,8]
[{"$nulls":5},5,"N. Runkel",9,1,2,18]
[{"$nulls":5},6,"S. Halfhead",8,1,2,33]
[{"$nulls":5},7,"Run Out",0,0,1,0]
[{"$nulls":5},8]
[{"$nulls":5},9]
[{"$nulls":5},10]
[{"$nulls":5},11]
[]
[{"$nulls":5},"Bowling Extras",null,11]

{"sheet":"Stonor (1)","index":16,"n_rows":36,"n_cols":39,"rows_kept":36,"merged":[[2,2,2,10],[4,5,4,8],[21,5,21,10]]}
[]
[{"$nulls":13},"Date","Opposition","Match Status","Home/Away","Captain","TPCC Batting First","TPCC Team Score","TPCC Team Wickets","Opposition Team Score","Opposition Team Wickets","TPCC Overs Bowled","TPCC Overs Faced","Batting Extras","Bowling Extras","Batsmen Position","Batsmen Name","Batsmen Runs","Batsmen Out",50,100,"Bowler Position","Bowler Name","Bowler Overs","Bowler Maidens","Bowler Wickets","Bowler Runs"]
[null,null,"Match Overview",{"$nulls":10},{"$f":"$D$5","v":41077},{"$f":"$D$7","v":"Stonor (1)"},{"$f":"$D$9","v":"Win"},{"$f":"$D$11","v":"Away"},{"$f":"$D$24","v":"S. Beardall"},{"$f":"$D$13","v":"Second"},{"$f":"$D$15","v":130},{"$f":"$D$16","v":4},{"$f":"$D$18","v":129},{"$f":"$D$19","v":10},{"$f":"$D$21","v":37},{"$f":"$D$22","v":25},{"$f":"$H$19","v":12},{"$f":"$H$36","v":3},{"$f":"F7","v":1},{"$f":"G7","v":"R. Dickie"},{"$f":"H7","v":6},{"$f":"I7","v":1},{"$f":"(IF(AD3>49,1,0))-AG3","v":0},{"$f":"IF(AD3>99,1,0)","v":0},{"$f":"F24","v":1},{"$f":"G24","v":"T. White"},5,0,0,19]
[{"$nulls":13},41077,"Stonor (1)","Win","Away",{"$f":"$D$24","v":"S. Beardall"},"Second",130,4,129,10,37,25,12,3,{"$f":"F8","v":2},"J. Moberly",5,1,{"$f":"(IF(AD4>49,1,0))-AG4","v":0},{"$f":"IF(AD4>99,1,0)","v":0},{"$f":"F25","v":2},"J. Hunt",10,2,2,29]
[null,null,"Date","2012-06-17",null,"Batting ",{"$nulls":7},41077,"Stonor (1)","Win","Away","S. Beardall","Second",130,4,129,10,37,25,12,3,3,"T. Wade",5,1,0,0,3,"J. Hancock",12,2,5,35]
[{"$nulls":5},"Position","Name","Runs","Out",{"$nulls":4},41077,"Stonor (1)","Win","Away","S. Beardall","Second",130,4,129,10,37,25,12,3,4,"J. Hunt",45,0,0,0,4,"N. Henry",7,0,1,28]
[null,null,"Opposition","Stonor (1)",null,1,"R. Dickie",6,1,{"$nulls":4},41077,"Stonor (1)","Win","Away","S. Beardall","Second",130,4,129,10,37,25,12,3,5,"P. Briffett",15,1,0,0,5,"D. Stockings",3,0,2,15]
[{"$nulls":5},2,"J. Moberly",5,1,{"$nulls":4},41077,"Stonor (1)","Win","Away","S. Beardall","Second",130,4,129,10,37,25,12,3,6,"J. Hancock",42,0,0,0,6,0,0,0,0,0]
[null,null,"Match Status","Win",null,3,"T. Wade",5,1,{"$nulls":4},41077,"Stonor (1)","Win","Away","S. Beardall","Second",130,4,129,10,37,25,12,3,7,0,0,0,0,0,7,0,0,0,0,0]
[{"$nulls":5},4,"J. Hunt",45,0,{"$nulls":4},41077,"Stonor (1)","Win","Away","S. Beardall","Second",130,4,129,10,37,25,12,3,8,0,0,0,0,0,8,0,0,0,0,0]
[null,null,"Home / Away","Away",null,5,"P. Briffett",15,1,{"$nulls":4},41077,"Stonor (1)","Win","Away","S. Beardall","Second",130,4,129,10,37,25,12,3,9,0,0,0,0,0,9,0,0,0,0,0]
[{"$nulls":5},6,"J. Hancock",42,0,{"$nulls":4},41077,"Stonor (1)","Win","Away","S. Beardall","Second",130,4,129,10,37,25,12,3,10,0,0,0,0,0,10,0,0,0,0,0]
[null,null,"TPCC Batting First","Second",null,7,{"$nulls":7},41077,"Stonor (1)","Win","Away","S. Beardall","Second",130,4,129,10,37,25,12,3,11,0,0,0,0,0,11,0,0,0,0,0]
[{"$nulls":5},8]
[null,null,"TPCC Team Score",{"$f":"SUM(H7:H17)+H19","v":130},null,9]
[null,null,"TPCC Team Wickets",{"$f":"SUM(I7:I17)","v":4},null,10]
[{"$nulls":5},11]
[null,null,"Opposition Team Score",{"$f":"SUM(K24:K34)+H36","v":129}]
[null,null,"Opposition Team Wickets",{"$f":"SUM(J24:J34)","v":10},null,"Batting Extras",null,12]
[]
[null,null,"TPCC Overs Bowled",{"$f":"SUM(H24:H34)","v":37}]
[null,null,"Opposition Overs Bowled",25,null,"Bowling"]
[{"$nulls":5},"Position","Name","Overs","Maidens","Wickets","Runs"]
[null,null,"TPCC Captain","S. Beardall",null,1,"T. White",5,0,0,19]
[{"$nulls":5},2,"J. Hunt",10,2,2,29]
[{"$nulls":5},3,"J. Hancock",12,2,5,35]
[{"$nulls":5},4,"N. Henry",7,0,1,28]
[{"$nulls":5},5,"D. Stockings",3,0,2,15]
[{"$nulls":5},6]
[{"$nulls":5},7]
[{"$nulls":5},8]
[{"$nulls":5},9]
[{"$nulls":5},10]
[{"$nulls":5},11]
[]
[{"$nulls":5},"Bowling Extras",null,3]

{"sheet":"Theberton","index":17,"n_rows":36,"n_cols":39,"rows_kept":36,"merged":[[2,2,2,10],[4,5,4,8],[21,5,21,10]]}
[]
[{"$nulls":13},"Date","Opposition","Match Status","Home/Away","Captain","TPCC Batting First","TPCC Team Score","TPCC Team Wickets","Opposition Team Score","Opposition Team Wickets","TPCC Overs Bowled","TPCC Overs Faced","Batting Extras","Bowling Extras","Batsmen Position","Batsmen Name","Batsmen Runs","Batsmen Out",50,100,"Bowler Position","Bowler Name","Bowler Overs","Bowler Maidens","Bowler Wickets","Bowler Runs"]
[null,null,"Match Overview",{"$nulls":10},{"$f":"$D$5","v":41084},{"$f":"$D$7","v":"Theberton"},{"$f":"$D$9","v":"Win"},{"$f":"$D$11","v":"Home"},{"$f":"$D$24","v":"S. Beardall"},{"$f":"$D$13","v":"First"},{"$f":"$D$15","v":191},{"$f":"$D$16","v":8},{"$f":"$D$18","v":126},{"$f":"$D$19","v":10},{"$f":"$D$21","v":21},{"$f":"$D$22","v":35},{"$f":"$H$19","v":5},{"$f":"$H$36","v":2},{"$f":"F7","v":1},{"$f":"G7","v":"S. Beardall"},{"$f":"H7","v":8},{"$f":"I7","v":1},{"$f":"(IF(AD3>49,1,0))-AG3","v":0},{"$f":"IF(AD3>99,1,0)","v":0},{"$f":"F24","v":1},{"$f":"G24","v":"J. Leefe"},7,0,3,25]
[{"$nulls":13},41084,"Theberton","Win","Home",{"$f":"$D$24","v":"S. Beardall"},"First",191,8,126,10,21,35,5,2,{"$f":"F8","v":2},"O. Thornton",100,1,{"$f":"(IF(AD4>49,1,0))-AG4","v":0},{"$f":"IF(AD4>99,1,0)","v":1},{"$f":"F25","v":2},"J. Thornton",7,0,3,34]
[null,null,"Date","2012-06-24",null,"Batting ",{"$nulls":7},41084,"Theberton","Win","Home","S. Beardall","First",191,8,126,10,21,35,5,2,3,"P. Briffett",5,1,0,0,3,"N. Runkel",4,0,3,27]
[{"$nulls":5},"Position","Name","Runs","Out",{"$nulls":4},41084,"Theberton","Win","Home","S. Beardall","First",191,8,126,10,21,35,5,2,4,"C. Beardall",0,1,0,0,4,"N. Henry",3,0,1,38]
[null,null,"Opposition","Theberton",null,1,"S. Beardall",8,1,{"$nulls":4},41084,"Theberton","Win","Home","S. Beardall","First",191,8,126,10,21,35,5,2,5,"T. Wade",49,1,0,0,5,0,0,0,0,0]
[{"$nulls":5},2,"O. Thornton",100,1,{"$nulls":4},41084,"Theberton","Win","Home","S. Beardall","First",191,8,126,10,21,35,5,2,6,"S. Halfhead",0,1,0,0,6,0,0,0,0,0]
[null,null,"Match Status","Win",null,3,"P. Briffett",5,1,{"$nulls":4},41084,"Theberton","Win","Home","S. Beardall","First",191,8,126,10,21,35,5,2,7,"C. Simon",7,1,0,0,7,0,0,0,0,0]
[{"$nulls":5},4,"C. Beardall",0,1,{"$nulls":4},41084,"Theberton","Win","Home","S. Beardall","First",191,8,126,10,21,35,5,2,8,"J. Thornton",10,0,0,0,8,0,0,0,0,0]
[null,null,"Home / Away","Home",null,5,"T. Wade",49,1,{"$nulls":4},41084,"Theberton","Win","Home","S. Beardall","First",191,8,126,10,21,35,5,2,9,"N. Henry",5,1,0,0,9,0,0,0,0,0]
[{"$nulls":5},6,"S. Halfhead",0,1,{"$nulls":4},41084,"Theberton","Win","Home","S. Beardall","First",191,8,126,10,21,35,5,2,10,"J. Leefe",2,0,0,0,10,0,0,0,0,0]
[null,null,"TPCC Batting First","First",null,7,"C. Simon",7,1,{"$nulls":4},41084,"Theberton","Win","Home","S. Beardall","First",191,8,126,10,21,35,5,2,11,0,0,0,0,0,11,0,0,0,0,0]
[{"$nulls":5},8,"J. Thornton",10,0]
[null,null,"TPCC Team Score",{"$f":"SUM(H7:H17)+H19","v":191},null,9,"N. Henry",5,1]
[null,null,"TPCC Team Wickets",{"$f":"SUM(I7:I17)","v":8},null,10,"J. Leefe",2,0]
[{"$nulls":5},11]
[null,null,"Opposition Team Score",{"$f":"SUM(K24:K34)+H36","v":126}]
[null,null,"Opposition Team Wickets",{"$f":"SUM(J24:J34)","v":10},null,"Batting Extras",null,5]
[]
[null,null,"TPCC Overs Bowled",{"$f":"SUM(H24:H34)","v":21}]
[null,null,"Opposition Overs Bowled",35,null,"Bowling"]
[{"$nulls":5},"Position","Name","Overs","Maidens","Wickets","Runs"]
[null,null,"TPCC Captain","S. Beardall",null,1,"J. Leefe",7,0,3,25]
[{"$nulls":5},2,"J. Thornton",7,0,3,34]
[{"$nulls":5},3,"N. Runkel",4,0,3,27]
[{"$nulls":5},4,"N. Henry",3,0,1,38]
[{"$nulls":5},5]
[{"$nulls":5},6]
[{"$nulls":5},7]
[{"$nulls":5},8]
[{"$nulls":5},9]
[{"$nulls":5},10]
[{"$nulls":5},11]
[]
[{"$nulls":5},"Bowling Extras",null,2]

{"sheet":"Oporto (1)","index":18,"n_rows":36,"n_cols":39,"rows_kept":36,"merged":[[2,2,2,10],[4,5,4,8],[21,5,21,10]]}
[]
[{"$nulls":13},"Date","Opposition","Match Status","Home/Away","Captain","TPCC Batting First","TPCC Team Score","TPCC Team Wickets","Opposition Team Score","Opposition Team Wickets","TPCC Overs Bowled","TPCC Overs Faced","Batting Extras","Bowling Extras","Batsmen Position","Batsmen Name","Batsmen Runs","Batsmen Out",50,100,"Bowler Position","Bowler Name","Bowler Overs","Bowler Maidens","Bowler Wickets","Bowler Runs"]
[null,null,"Match Overview",{"$nulls":10},{"$f":"$D$5","v":41090},{"$f":"$D$7","v":"Oporto"},{"$f":"$D$9","v":"Win"},{"$f":"$D$11","v":"Tour"},{"$f":"$D$24","v":"S. Beardall"},{"$f":"$D$13","v":"Second"},{"$f":"$D$15","v":168},{"$f":"$D$16","v":6},{"$f":"$D$18","v":166},{"$f":"$D$19","v":10},{"$f":"$D$21","v":45},{"$f":"$D$22","v":41},{"$f":"$H$19","v":33},{"$f":"$H$36","v":1},{"$f":"F7","v":1},{"$f":"G7","v":"O. Thornton"},{"$f":"H7","v":17},{"$f":"I7","v":1},{"$f":"(IF(AD3>49,1,0))-AG3","v":0},{"$f":"IF(AD3>99,1,0)","v":0},{"$f":"F24","v":1},{"$f":"G24","v":"P. Girdler"},6,0,1,30]
[{"$nulls":13},41090,"Oporto","Win","Tour",{"$f":"$D$24","v":"S. Beardall"},"Second",168,6,166,10,45,41,33,1,{"$f":"F8","v":2},"S. Halfhead",7,1,{"$f":"(IF(AD4>49,1,0))-AG4","v":0},{"$f":"IF(AD4>99,1,0)","v":0},{"$f":"F25","v":2},"T. White",4,0,0,12]
[null,null,"Date","2012-06-30",null,"Batting ",{"$nulls":7},41090,"Oporto","Win","Tour","S. Beardall","Second",168,6,166,10,45,41,33,1,3,"Ro. Dickie",3,1,0,0,3,"J. Thornton",7,0,1,45]
[{"$nulls":5},"Position","Name","Runs","Out",{"$nulls":4},41090,"Oporto","Win","Tour","S. Beardall","Second",168,6,166,10,45,41,33,1,4,"P. Briffett",9,1,0,0,4,"J. Hunt",4,0,0,14]
[null,null,"Opposition","Oporto",null,1,"O. Thornton",17,1,{"$nulls":4},41090,"Oporto","Win","Tour","S. Beardall","Second",168,6,166,10,45,41,33,1,5,"S. Beardall",4,1,0,0,5,"O. Thornton",5,2,2,9]
[{"$nulls":5},2,"S. Halfhead",7,1,{"$nulls":4},41090,"Oporto","Win","Tour","S. Beardall","Second",168,6,166,10,45,41,33,1,6,"B. Bazell",9,1,0,0,6,"N. Runkel",11,3,2,17]
[null,null,"Match Status","Win",null,3,"Ro. Dickie",3,1,{"$nulls":4},41090,"Oporto","Win","Tour","S. Beardall","Second",168,6,166,10,45,41,33,1,7,"J. Hunt",57,0,1,0,7,"S. Halfhead",2,1,0,12]
[{"$nulls":5},4,"P. Briffett",9,1,{"$nulls":4},41090,"Oporto","Win","Tour","S. Beardall","Second",168,6,166,10,45,41,33,1,8,"J. Thornton",29,0,0,0,8,"P. Briffett",5,0,2,25]
[null,null,"Home / Away","Tour",null,5,"S. Beardall",4,1,{"$nulls":4},41090,"Oporto","Win","Tour","S. Beardall","Second",168,6,166,10,45,41,33,1,9,0,0,0,0,0,9,"Ro. Dickie",1,0,1,1]
[{"$nulls":5},6,"B. Bazell",9,1,{"$nulls":4},41090,"Oporto","Win","Tour","S. Beardall","Second",168,6,166,10,45,41,33,1,10,0,0,0,0,0,10,"Run Out",0,0,1,0]
[null,null,"TPCC Batting First","Second",null,7,"J. Hunt",57,0,{"$nulls":4},41090,"Oporto","Win","Tour","S. Beardall","Second",168,6,166,10,45,41,33,1,11,0,0,0,0,0,11,0,0,0,0,0]
[{"$nulls":5},8,"J. Thornton",29,0]
[null,null,"TPCC Team Score",{"$f":"SUM(H7:H17)+H19","v":168},null,9]
[null,null,"TPCC Team Wickets",{"$f":"SUM(I7:I17)","v":6},null,10]
[{"$nulls":5},11]
[null,null,"Opposition Team Score",{"$f":"SUM(K24:K34)+H36","v":166}]
[null,null,"Opposition Team Wickets",{"$f":"SUM(J24:J34)","v":10},null,"Batting Extras",null,33]
[]
[null,null,"TPCC Overs Bowled",{"$f":"SUM(H24:H34)","v":45}]
[null,null,"Opposition Overs Bowled",41,null,"Bowling"]
[{"$nulls":5},"Position","Name","Overs","Maidens","Wickets","Runs"]
[null,null,"TPCC Captain","S. Beardall",null,1,"P. Girdler",6,0,1,30]
[{"$nulls":5},2,"T. White",4,0,0,12]
[{"$nulls":5},3,"J. Thornton",7,0,1,45]
[{"$nulls":5},4,"J. Hunt",4,0,0,14]
[{"$nulls":5},5,"O. Thornton",5,2,2,9]
[{"$nulls":5},6,"N. Runkel",11,3,2,17]
[{"$nulls":5},7,"S. Halfhead",2,1,0,12]
[{"$nulls":5},8,"P. Briffett",5,0,2,25]
[{"$nulls":5},9,"Ro. Dickie",1,0,1,1]
[{"$nulls":5},10,"Run Out",0,0,1,0]
[{"$nulls":5},11]
[]
[{"$nulls":5},"Bowling Extras",null,1]

{"sheet":"Oporto (2)","index":19,"n_rows":36,"n_cols":39,"rows_kept":36,"merged":[[2,2,2,10],[4,5,4,8],[21,5,21,10]]}
[]
[{"$nulls":13},"Date","Opposition","Match Status","Home/Away","Captain","TPCC Batting First","TPCC Team Score","TPCC Team Wickets","Opposition Team Score","Opposition Team Wickets","TPCC Overs Bowled","TPCC Overs Faced","Batting Extras","Bowling Extras","Batsmen Position","Batsmen Name","Batsmen Runs","Batsmen Out",50,100,"Bowler Position","Bowler Name","Bowler Overs","Bowler Maidens","Bowler Wickets","Bowler Runs"]
[null,null,"Match Overview",{"$nulls":10},{"$f":"$D$5","v":41091},{"$f":"$D$7","v":"Oporto (2)"},{"$f":"$D$9","v":"Win"},{"$f":"$D$11","v":"Tour"},{"$f":"$D$24","v":"S. Beardall"},{"$f":"$D$13","v":"Second"},{"$f":"$D$15","v":184},{"$f":"$D$16","v":10},{"$f":"$D$18","v":136},{"$f":"$D$19","v":10},{"$f":"$D$21","v":39},{"$f":"$D$22","v":41},{"$f":"$H$19","v":41},{"$f":"$H$36","v":15},{"$f":"F7","v":1},{"$f":"G7","v":"C. Simon"},{"$f":"H7","v":17},{"$f":"I7","v":1},{"$f":"(IF(AD3>49,1,0))-AG3","v":0},{"$f":"IF(AD3>99,1,0)","v":0},{"$f":"F24","v":1},{"$f":"G24","v":"P. Girdler"},7,1,0,22]
[{"$nulls":13},41091,"Oporto (2)","Win","Tour",{"$f":"$D$24","v":"S. Beardall"},"Second",184,10,136,10,39,41,41,15,{"$f":"F8","v":2},"T. Farley",10,1,{"$f":"(IF(AD4>49,1,0))-AG4","v":0},{"$f":"IF(AD4>99,1,0)","v":0},{"$f":"F25","v":2},"J. Hunt",5,0,2,15]
[null,null,"Date","2012-07-01",null,"Batting ",{"$nulls":7},41091,"Oporto (2)","Win","Tour","S. Beardall","Second",184,10,136,10,39,41,41,15,3,"J. Hunt",11,1,0,0,3,"T. Farley",4,0,1,23]
[{"$nulls":5},"Position","Name","Runs","Out",{"$nulls":4},41091,"Oporto (2)","Win","Tour","S. Beardall","Second",184,10,136,10,39,41,41,15,4,"D. Stockings",8,1,0,0,4,"D. Stockings",1,0,0,18]
[null,null,"Opposition","Oporto (2)",null,1,"C. Simon",17,1,{"$nulls":4},41091,"Oporto (2)","Win","Tour","S. Beardall","Second",184,10,136,10,39,41,41,15,5,"T. Greenwood",2,1,0,0,5,"T. White",11,4,1,23]
[{"$nulls":5},2,"T. Farley",10,1,{"$nulls":4},41091,"Oporto (2)","Win","Tour","S. Beardall","Second",184,10,136,10,39,41,41,15,6,"O. Thornton",56,1,1,0,6,"S. Beardall",6,2,1,15]
[null,null,"Match Status","Win",null,3,"J. Hunt",11,1,{"$nulls":4},41091,"Oporto (2)","Win","Tour","S. Beardall","Second",184,10,136,10,39,41,41,15,7,"S. Beardall",9,1,0,0,7,"J. Thornton",5,1,3,5]
[{"$nulls":5},4,"D. Stockings",8,1,{"$nulls":4},41091,"Oporto (2)","Win","Tour","S. Beardall","Second",184,10,136,10,39,41,41,15,8,"J. Thornton",18,1,0,0,8,"Run Out",0,0,2,0]
[null,null,"Home / Away","Tour",null,5,"T. Greenwood",2,1,{"$nulls":4},41091,"Oporto (2)","Win","Tour","S. Beardall","Second",184,10,136,10,39,41,41,15,9,"P. Briffett",3,1,0,0,9,0,0,0,0,0]
[{"$nulls":5},6,"O. Thornton",56,1,{"$nulls":4},41091,"Oporto (2)","Win","Tour","S. Beardall","Second",184,10,136,10,39,41,41,15,10,"T. White",8,1,0,0,10,0,0,0,0,0]
[null,null,"TPCC Batting First","Second",null,7,"S. Beardall",9,1,{"$nulls":4},41091,"Oporto (2)","Win","Tour","S. Beardall","Second",184,10,136,10,39,41,41,15,11,"P. Girdler",1,0,0,0,11,0,0,0,0,0]
[{"$nulls":5},8,"J. Thornton",18,1]
[null,null,"TPCC Team Score",{"$f":"SUM(H7:H17)+H19","v":184},null,9,"P. Briffett",3,1]
[null,null,"TPCC Team Wickets",{"$f":"SUM(I7:I17)","v":10},null,10,"T. White",8,1]
[{"$nulls":5},11,"P. Girdler",1,0]
[null,null,"Opposition Team Score",{"$f":"SUM(K24:K34)+H36","v":136}]
[null,null,"Opposition Team Wickets",{"$f":"SUM(J24:J34)","v":10},null,"Batting Extras",null,41]
[]
[null,null,"TPCC Overs Bowled",{"$f":"SUM(H24:H34)","v":39}]
[null,null,"Opposition Overs Bowled",41,null,"Bowling"]
[{"$nulls":5},"Position","Name","Overs","Maidens","Wickets","Runs"]
[null,null,"TPCC Captain","S. Beardall",null,1,"P. Girdler",7,1,0,22]
[{"$nulls":5},2,"J. Hunt",5,0,2,15]
[{"$nulls":5},3,"T. Farley",4,0,1,23]
[{"$nulls":5},4,"D. Stockings",1,0,0,18]
[{"$nulls":5},5,"T. White",11,4,1,23]
[{"$nulls":5},6,"S. Beardall",6,2,1,15]
[{"$nulls":5},7,"J. Thornton",5,1,3,5]
[{"$nulls":5},8,"Run Out",0,0,2,0]
[{"$nulls":5},9]
[{"$nulls":5},10]
[{"$nulls":5},11]
[]
[{"$nulls":5},"Bowling Extras",null,15]

{"sheet":"Woodcote","index":20,"n_rows":36,"n_cols":39,"rows_kept":36,"merged":[[2,2,2,10],[4,5,4,8],[21,5,21,10]]}
[]
[{"$nulls":13},"Date","Opposition","Match Status","Home/Away","Captain","TPCC Batting First","TPCC Team Score","TPCC Team Wickets","Opposition Team Score","Opposition Team Wickets","TPCC Overs Bowled","TPCC Overs Faced","Batting Extras","Bowling Extras","Batsmen Position","Batsmen Name","Batsmen Runs","Batsmen Out",50,100,"Bowler Position","Bowler Name","Bowler Overs","Bowler Maidens","Bowler Wickets","Bowler Runs"]
[null,null,"Match Overview",{"$nulls":10},{"$f":"$D$5","v":41096},{"$f":"$D$7","v":"Woodcote"},{"$f":"$D$9","v":"Cancelled (Turville)"},{"$f":"$D$11","v":"Away"},{"$f":"$D$24","v":0},{"$f":"$D$13","v":0},{"$f":"$D$15","v":0},{"$f":"$D$16","v":0},{"$f":"$D$18","v":0},{"$f":"$D$19","v":0},{"$f":"$D$21","v":0},{"$f":"$D$22","v":0},{"$f":"$H$19","v":0},{"$f":"$H$36","v":0},{"$f":"F7","v":1},{"$f":"G7","v":0},{"$f":"H7","v":0},{"$f":"I7","v":0},{"$f":"(IF(AD3>49,1,0))-AG3","v":0},{"$f":"IF(AD3>99,1,0)","v":0},{"$f":"F24","v":1},{"$f":"G24","v":0},0,0,0,0]
[{"$nulls":13},41096,"Woodcote","Cancelled (Turville)","Away",{"$f":"$D$24","v":0},0,0,0,0,0,0,0,0,0,{"$f":"F8","v":2},0,0,0,{"$f":"(IF(AD4>49,1,0))-AG4","v":0},{"$f":"IF(AD4>99,1,0)","v":0},{"$f":"F25","v":2},0,0,0,0,0]
[null,null,"Date","2012-07-06",null,"Batting ",{"$nulls":7},41096,"Woodcote","Cancelled (Turville)","Away",0,0,0,0,0,0,0,0,0,0,3,0,0,0,0,0,3,0,0,0,0,0]
[{"$nulls":5},"Position","Name","Runs","Out",{"$nulls":4},41096,"Woodcote","Cancelled (Turville)","Away",0,0,0,0,0,0,0,0,0,0,4,0,0,0,0,0,4,0,0,0,0,0]
[null,null,"Opposition","Woodcote",null,1,{"$nulls":7},41096,"Woodcote","Cancelled (Turville)","Away",0,0,0,0,0,0,0,0,0,0,5,0,0,0,0,0,5,0,0,0,0,0]
[{"$nulls":5},2,{"$nulls":7},41096,"Woodcote","Cancelled (Turville)","Away",0,0,0,0,0,0,0,0,0,0,6,0,0,0,0,0,6,0,0,0,0,0]
[null,null,"Match Status","Cancelled (Turville)",null,3,{"$nulls":7},41096,"Woodcote","Cancelled (Turville)","Away",0,0,0,0,0,0,0,0,0,0,7,0,0,0,0,0,7,0,0,0,0,0]
[{"$nulls":5},4,{"$nulls":7},41096,"Woodcote","Cancelled (Turville)","Away",0,0,0,0,0,0,0,0,0,0,8,0,0,0,0,0,8,0,0,0,0,0]
[null,null,"Home / Away","Away",null,5,{"$nulls":7},41096,"Woodcote","Cancelled (Turville)","Away",0,0,0,0,0,0,0,0,0,0,9,0,0,0,0,0,9,0,0,0,0,0]
[{"$nulls":5},6,{"$nulls":7},41096,"Woodcote","Cancelled (Turville)","Away",0,0,0,0,0,0,0,0,0,0,10,0,0,0,0,0,10,0,0,0,0,0]
[null,null,"TPCC Batting First",null,null,7,{"$nulls":7},41096,"Woodcote","Cancelled (Turville)","Away",0,0,0,0,0,0,0,0,0,0,11,0,0,0,0,0,11,0,0,0,0,0]
[{"$nulls":5},8]
[null,null,"TPCC Team Score",{"$f":"SUM(H7:H17)+H19","v":0},null,9]
[null,null,"TPCC Team Wickets",{"$f":"SUM(I7:I17)","v":0},null,10]
[{"$nulls":5},11]
[null,null,"Opposition Team Score",{"$f":"SUM(K24:K34)+H36","v":0}]
[null,null,"Opposition Team Wickets",{"$f":"SUM(J24:J34)","v":0},null,"Batting Extras"]
[]
[null,null,"TPCC Overs Bowled",{"$f":"SUM(H24:H34)","v":0}]
[null,null,"Opposition Overs Bowled",null,null,"Bowling"]
[{"$nulls":5},"Position","Name","Overs","Maidens","Wickets","Runs"]
[null,null,"TPCC Captain",null,null,1]
[{"$nulls":5},2]
[{"$nulls":5},3]
[{"$nulls":5},4]
[{"$nulls":5},5]
[{"$nulls":5},6]
[{"$nulls":5},7]
[{"$nulls":5},8]
[{"$nulls":5},9]
[{"$nulls":5},10]
[{"$nulls":5},11]
[]
[{"$nulls":5},"Bowling Extras"]

{"sheet":"Flycatchers","index":21,"n_rows":36,"n_cols":39,"rows_kept":36,"merged":[[2,2,2,10],[4,5,4,8],[21,5,21,10]]}
[]
[{"$nulls":13},"Date","Opposition","Match Status","Home/Away","Captain","TPCC Batting First","TPCC Team Score","TPCC Team Wickets","Opposition Team Score","Opposition Team Wickets","TPCC Overs Bowled","TPCC Overs Faced","Batting Extras","Bowling Extras","Batsmen Position","Batsmen Name","Batsmen Runs","Batsmen Out",50,100,"Bowler Position","Bowler Name","Bowler Overs","Bowler Maidens","Bowler Wickets","Bowler Runs"]
[null,null,"Match Overview",{"$nulls":10},{"$f":"$D$5","v":41098},{"$f":"$D$7","v":"Flycatchers"},{"$f":"$D$9","v":"Cancelled (Rain)"},{"$f":"$D$11","v":"Home"},{"$f":"$D$24","v":0},{"$f":"$D$13","v":0},{"$f":"$D$15","v":0},{"$f":"$D$16","v":0},{"$f":"$D$18","v":0},{"$f":"$D$19","v":0},{"$f":"$D$21","v":0},{"$f":"$D$22","v":0},{"$f":"$H$19","v":0},{"$f":"$H$36","v":0},{"$f":"F7","v":1},{"$f":"G7","v":0},{"$f":"H7","v":0},{"$f":"I7","v":0},{"$f":"(IF(AD3>49,1,0))-AG3","v":0},{"$f":"IF(AD3>99,1,0)","v":0},{"$f":"F24","v":1},{"$f":"G24","v":0},0,0,0,0]
[{"$nulls":13},41098,"Flycatchers","Cancelled (Rain)","Home",{"$f":"$D$24","v":0},0,0,0,0,0,0,0,0,0,{"$f":"F8","v":2},0,0,0,{"$f":"(IF(AD4>49,1,0))-AG4","v":0},{"$f":"IF(AD4>99,1,0)","v":0},{"$f":"F25","v":2},0,0,0,0,0]
[null,null,"Date","2012-07-08",null,"Batting ",{"$nulls":7},41098,"Flycatchers","Cancelled (Rain)","Home",0,0,0,0,0,0,0,0,0,0,3,0,0,0,0,0,3,0,0,0,0,0]
[{"$nulls":5},"Position","Name","Runs","Out",{"$nulls":4},41098,"Flycatchers","Cancelled (Rain)","Home",0,0,0,0,0,0,0,0,0,0,4,0,0,0,0,0,4,0,0,0,0,0]
[null,null,"Opposition","Flycatchers",null,1,{"$nulls":7},41098,"Flycatchers","Cancelled (Rain)","Home",0,0,0,0,0,0,0,0,0,0,5,0,0,0,0,0,5,0,0,0,0,0]
[{"$nulls":5},2,{"$nulls":7},41098,"Flycatchers","Cancelled (Rain)","Home",0,0,0,0,0,0,0,0,0,0,6,0,0,0,0,0,6,0,0,0,0,0]
[null,null,"Match Status","Cancelled (Rain)",null,3,{"$nulls":7},41098,"Flycatchers","Cancelled (Rain)","Home",0,0,0,0,0,0,0,0,0,0,7,0,0,0,0,0,7,0,0,0,0,0]
[{"$nulls":5},4,{"$nulls":7},41098,"Flycatchers","Cancelled (Rain)","Home",0,0,0,0,0,0,0,0,0,0,8,0,0,0,0,0,8,0,0,0,0,0]
[null,null,"Home / Away","Home",null,5,{"$nulls":7},41098,"Flycatchers","Cancelled (Rain)","Home",0,0,0,0,0,0,0,0,0,0,9,0,0,0,0,0,9,0,0,0,0,0]
[{"$nulls":5},6,{"$nulls":7},41098,"Flycatchers","Cancelled (Rain)","Home",0,0,0,0,0,0,0,0,0,0,10,0,0,0,0,0,10,0,0,0,0,0]
[null,null,"TPCC Batting First",null,null,7,{"$nulls":7},41098,"Flycatchers","Cancelled (Rain)","Home",0,0,0,0,0,0,0,0,0,0,11,0,0,0,0,0,11,0,0,0,0,0]
[{"$nulls":5},8]
[null,null,"TPCC Team Score",{"$f":"SUM(H7:H17)+H19","v":0},null,9]
[null,null,"TPCC Team Wickets",{"$f":"SUM(I7:I17)","v":0},null,10]
[{"$nulls":5},11]
[null,null,"Opposition Team Score",{"$f":"SUM(K24:K34)+H36","v":0}]
[null,null,"Opposition Team Wickets",{"$f":"SUM(J24:J34)","v":0},null,"Batting Extras"]
[]
[null,null,"TPCC Overs Bowled",{"$f":"SUM(H24:H34)","v":0}]
[null,null,"Opposition Overs Bowled",null,null,"Bowling"]
[{"$nulls":5},"Position","Name","Overs","Maidens","Wickets","Runs"]
[null,null,"TPCC Captain",null,null,1]
[{"$nulls":5},2]
[{"$nulls":5},3]
[{"$nulls":5},4]
[{"$nulls":5},5]
[{"$nulls":5},6]
[{"$nulls":5},7]
[{"$nulls":5},8]
[{"$nulls":5},9]
[{"$nulls":5},10]
[{"$nulls":5},11]
[]
[{"$nulls":5},"Bowling Extras"]

{"sheet":"Ibstone","index":22,"n_rows":36,"n_cols":39,"rows_kept":36,"merged":[[2,2,2,10],[4,5,4,8],[21,5,21,10]]}
[]
[{"$nulls":13},"Date","Opposition","Match Status","Home/Away","Captain","TPCC Batting First","TPCC Team Score","TPCC Team Wickets","Opposition Team Score","Opposition Team Wickets","TPCC Overs Bowled","TPCC Overs Faced","Batting Extras","Bowling Extras","Batsmen Position","Batsmen Name","Batsmen Runs","Batsmen Out",50,100,"Bowler Position","Bowler Name","Bowler Overs","Bowler Maidens","Bowler Wickets","Bowler Runs"]
[null,null,"Match Overview",{"$nulls":10},{"$f":"$D$5","v":41105},{"$f":"$D$7","v":"Ibstone"},{"$f":"$D$9","v":"Win"},{"$f":"$D$11","v":"Away"},{"$f":"$D$24","v":"S. Beardall"},{"$f":"$D$13","v":"First"},{"$f":"$D$15","v":200},{"$f":"$D$16","v":9},{"$f":"$D$18","v":61},{"$f":"$D$19","v":10},{"$f":"$D$21","v":32},{"$f":"$D$22","v":42},{"$f":"$H$19","v":1},{"$f":"$H$36","v":7},{"$f":"F7","v":1},{"$f":"G7","v":"S. Halfhead"},{"$f":"H7","v":9},{"$f":"I7","v":1},{"$f":"(IF(AD3>49,1,0))-AG3","v":0},{"$f":"IF(AD3>99,1,0)","v":0},{"$f":"F24","v":1},{"$f":"G24","v":"T. White"},8,7,8,4]
[{"$nulls":13},41105,"Ibstone","Win","Away",{"$f":"$D$24","v":"S. Beardall"},"First",200,9,61,10,32,42,1,7,{"$f":"F8","v":2},"J. Rogers",1,1,{"$f":"(IF(AD4>49,1,0))-AG4","v":0},{"$f":"IF(AD4>99,1,0)","v":0},{"$f":"F25","v":2},"S. Beardall",2,0,0,17]
[null,null,"Date","2012-07-15",null,"Batting ",{"$nulls":7},41105,"Ibstone","Win","Away","S. Beardall","First",200,9,61,10,32,42,1,7,3,"J. Hunt",64,1,1,0,3,"J. Rogers",10,2,2,27]
[{"$nulls":5},"Position","Name","Runs","Out",{"$nulls":4},41105,"Ibstone","Win","Away","S. Beardall","First",200,9,61,10,32,42,1,7,4,"C. Beardall",19,1,0,0,4,"C. Rogers",4,2,0,3]
[null,null,"Opposition","Ibstone",null,1,"S. Halfhead",9,1,{"$nulls":4},41105,"Ibstone","Win","Away","S. Beardall","First",200,9,61,10,32,42,1,7,5,"T. Wade",27,1,0,0,5,"J. Hancock",5,4,0,2]
[{"$nulls":5},2,"J. Rogers",1,1,{"$nulls":4},41105,"Ibstone","Win","Away","S. Beardall","First",200,9,61,10,32,42,1,7,6,"W. Strickland",0,1,0,0,6,"J. Hunt",3,2,0,1]
[null,null,"Match Status","Win",null,3,"J. Hunt",64,1,{"$nulls":4},41105,"Ibstone","Win","Away","S. Beardall","First",200,9,61,10,32,42,1,7,7,"J. Hancock",7,1,0,0,7,0,0,0,0,0]
[{"$nulls":5},4,"C. Beardall",19,1,{"$nulls":4},41105,"Ibstone","Win","Away","S. Beardall","First",200,9,61,10,32,42,1,7,8,"S. Beardall",55,0,1,0,8,0,0,0,0,0]
[null,null,"Home / Away","Away",null,5,"T. Wade",27,1,{"$nulls":4},41105,"Ibstone","Win","Away","S. Beardall","First",200,9,61,10,32,42,1,7,9,"B. Bazell",8,1,0,0,9,0,0,0,0,0]
[{"$nulls":5},6,"W. Strickland",0,1,{"$nulls":4},41105,"Ibstone","Win","Away","S. Beardall","First",200,9,61,10,32,42,1,7,10,"C. Rogers",9,1,0,0,10,0,0,0,0,0]
[null,null,"TPCC Batting First","First",null,7,"J. Hancock",7,1,{"$nulls":4},41105,"Ibstone","Win","Away","S. Beardall","First",200,9,61,10,32,42,1,7,11,"T. White",0,0,0,0,11,0,0,0,0,0]
[{"$nulls":5},8,"S. Beardall",55,0]
[null,null,"TPCC Team Score",{"$f":"SUM(H7:H17)+H19","v":200},null,9,"B. Bazell",8,1]
[null,null,"TPCC Team Wickets",{"$f":"SUM(I7:I17)","v":9},null,10,"C. Rogers",9,1]
[{"$nulls":5},11,"T. White",0,0]
[null,null,"Opposition Team Score",{"$f":"SUM(K24:K34)+H36","v":61}]
[null,null,"Opposition Team Wickets",{"$f":"SUM(J24:J34)","v":10},null,"Batting Extras",null,1]
[]
[null,null,"TPCC Overs Bowled",{"$f":"SUM(H24:H34)","v":32}]
[null,null,"Opposition Overs Bowled",42,null,"Bowling"]
[{"$nulls":5},"Position","Name","Overs","Maidens","Wickets","Runs"]
[null,null,"TPCC Captain","S. Beardall",null,1,"T. White",8,7,8,4]
[{"$nulls":5},2,"S. Beardall",2,0,0,17]
[{"$nulls":5},3,"J. Rogers",10,2,2,27]
[{"$nulls":5},4,"C. Rogers",4,2,0,3]
[{"$nulls":5},5,"J. Hancock",5,4,0,2]
[{"$nulls":5},6,"J. Hunt",3,2,0,1]
[{"$nulls":5},7]
[{"$nulls":5},8]
[{"$nulls":5},9]
[{"$nulls":5},10]
[{"$nulls":5},11]
[]
[{"$nulls":5},"Bowling Extras",null,7]

{"sheet":"Crossbatters","index":23,"n_rows":36,"n_cols":39,"rows_kept":36,"merged":[[2,2,2,10],[4,5,4,8],[21,5,21,10]]}
[]
[{"$nulls":13},"Date","Opposition","Match Status","Home/Away","Captain","TPCC Batting First","TPCC Team Score","TPCC Team Wickets","Opposition Team Score","Opposition Team Wickets","TPCC Overs Bowled","TPCC Overs Faced","Batting Extras","Bowling Extras","Batsmen Position","Batsmen Name","Batsmen Runs","Batsmen Out",50,100,"Bowler Position","Bowler Name","Bowler Overs","Bowler Maidens","Bowler Wickets","Bowler Runs"]
[null,null,"Match Overview",{"$nulls":10},{"$f":"$D$5","v":41111},{"$f":"$D$7","v":"Crossbatters"},{"$f":"$D$9","v":"Loss"},{"$f":"$D$11","v":"Home"},{"$f":"$D$24","v":"S. Beardall"},{"$f":"$D$13","v":"Second"},{"$f":"$D$15","v":62},{"$f":"$D$16","v":10},{"$f":"$D$18","v":179},{"$f":"$D$19","v":8},{"$f":"$D$21","v":35},{"$f":"$D$22","v":22},{"$f":"$H$19","v":2},{"$f":"$H$36","v":12},{"$f":"F7","v":1},{"$f":"G7","v":"S. Beardall"},{"$f":"H7","v":23},{"$f":"I7","v":1},{"$f":"(IF(AD3>49,1,0))-AG3","v":0},{"$f":"IF(AD3>99,1,0)","v":0},{"$f":"F24","v":1},{"$f":"G24","v":"J. Hunt"},5,0,3,9]
[{"$nulls":13},41111,"Crossbatters","Loss","Home",{"$f":"$D$24","v":"S. Beardall"},"Second",62,10,179,8,35,22,2,12,{"$f":"F8","v":2},"P. Briffett",1,1,{"$f":"(IF(AD4>49,1,0))-AG4","v":0},{"$f":"IF(AD4>99,1,0)","v":0},{"$f":"F25","v":2},"H. De Zulueta",6,0,1,35]
[null,null,"Date","2012-07-21",null,"Batting ",{"$nulls":7},41111,"Crossbatters","Loss","Home","S. Beardall","Second",62,10,179,8,35,22,2,12,3,"Ro. Dickie",8,1,0,0,3,"J. Leefe",8,1,0,29]
[{"$nulls":5},"Position","Name","Runs","Out",{"$nulls":4},41111,"Crossbatters","Loss","Home","S. Beardall","Second",62,10,179,8,35,22,2,12,4,"J. Hunt",25,1,0,0,4,"N. Henry",10,0,2,61]
[null,null,"Opposition","Crossbatters",null,1,"S. Beardall",23,1,{"$nulls":4},41111,"Crossbatters","Loss","Home","S. Beardall","Second",62,10,179,8,35,22,2,12,5,"J. Moberly",2,1,0,0,5,"D. Bradman",4,0,2,8]
[{"$nulls":5},2,"P. Briffett",1,1,{"$nulls":4},41111,"Crossbatters","Loss","Home","S. Beardall","Second",62,10,179,8,35,22,2,12,6,"J. Leefe",0,0,0,0,6,"P. Briffett",2,0,0,25]
[null,null,"Match Status","Loss",null,3,"Ro. Dickie",8,1,{"$nulls":4},41111,"Crossbatters","Loss","Home","S. Beardall","Second",62,10,179,8,35,22,2,12,7,"P. De Zulueta",0,1,0,0,7,0,0,0,0,0]
[{"$nulls":5},4,"J. Hunt",25,1,{"$nulls":4},41111,"Crossbatters","Loss","Home","S. Beardall","Second",62,10,179,8,35,22,2,12,8,"R. Beardall",0,1,0,0,8,0,0,0,0,0]
[null,null,"Home / Away","Home",null,5,"J. Moberly",2,1,{"$nulls":4},41111,"Crossbatters","Loss","Home","S. Beardall","Second",62,10,179,8,35,22,2,12,9,"H. De Zulueta",0,1,0,0,9,0,0,0,0,0]
[{"$nulls":5},6,"J. Leefe",0,0,{"$nulls":4},41111,"Crossbatters","Loss","Home","S. Beardall","Second",62,10,179,8,35,22,2,12,10,"D. Bradman",1,1,0,0,10,0,0,0,0,0]
[null,null,"TPCC Batting First","Second",null,7,"P. De Zulueta",0,1,{"$nulls":4},41111,"Crossbatters","Loss","Home","S. Beardall","Second",62,10,179,8,35,22,2,12,11,"N. Henry",0,1,0,0,11,0,0,0,0,0]
[{"$nulls":5},8,"R. Beardall",0,1]
[null,null,"TPCC Team Score",{"$f":"SUM(H7:H17)+H19","v":62},null,9,"H. De Zulueta",0,1]
[null,null,"TPCC Team Wickets",{"$f":"SUM(I7:I17)","v":10},null,10,"D. Bradman",1,1]
[{"$nulls":5},11,"N. Henry",0,1]
[null,null,"Opposition Team Score",{"$f":"SUM(K24:K34)+H36","v":179}]
[null,null,"Opposition Team Wickets",{"$f":"SUM(J24:J34)","v":8},null,"Batting Extras",null,2]
[]
[null,null,"TPCC Overs Bowled",{"$f":"SUM(H24:H34)","v":35}]
[null,null,"Opposition Overs Bowled",22,null,"Bowling"]
[{"$nulls":5},"Position","Name","Overs","Maidens","Wickets","Runs"]
[null,null,"TPCC Captain","S. Beardall",null,1,"J. Hunt",5,0,3,9]
[{"$nulls":5},2,"H. De Zulueta",6,0,1,35]
[{"$nulls":5},3,"J. Leefe",8,1,0,29]
[{"$nulls":5},4,"N. Henry",10,0,2,61]
[{"$nulls":5},5,"D. Bradman",4,0,2,8]
[{"$nulls":5},6,"P. Briffett",2,0,0,25]
[{"$nulls":5},7]
[{"$nulls":5},8]
[{"$nulls":5},9]
[{"$nulls":5},10]
[{"$nulls":5},11]
[]
[{"$nulls":5},"Bowling Extras",null,12]

{"sheet":"Warborough","index":24,"n_rows":36,"n_cols":39,"rows_kept":36,"merged":[[2,2,2,10],[4,5,4,8],[21,5,21,10]]}
[]
[{"$nulls":13},"Date","Opposition","Match Status","Home/Away","Captain","TPCC Batting First","TPCC Team Score","TPCC Team Wickets","Opposition Team Score","Opposition Team Wickets","TPCC Overs Bowled","TPCC Overs Faced","Batting Extras","Bowling Extras","Batsmen Position","Batsmen Name","Batsmen Runs","Batsmen Out",50,100,"Bowler Position","Bowler Name","Bowler Overs","Bowler Maidens","Bowler Wickets","Bowler Runs"]
[null,null,"Match Overview",{"$nulls":10},{"$f":"$D$5","v":41112},{"$f":"$D$7","v":"Warborough"},{"$f":"$D$9","v":"Draw"},{"$f":"$D$11","v":"Home"},{"$f":"$D$24","v":"S. Beardall"},{"$f":"$D$13","v":"First"},{"$f":"$D$15","v":248},{"$f":"$D$16","v":6},{"$f":"$D$18","v":110},{"$f":"$D$19","v":4},{"$f":"$D$21","v":38},{"$f":"$D$22","v":45},{"$f":"$H$19","v":14},{"$f":"$H$36","v":5},{"$f":"F7","v":1},{"$f":"G7","v":"C. Beardall"},{"$f":"H7","v":96},{"$f":"I7","v":1},{"$f":"(IF(AD3>49,1,0))-AG3","v":1},{"$f":"IF(AD3>99,1,0)","v":0},{"$f":"F24","v":1},{"$f":"G24","v":"J. Leefe"},8,0,2,31]
[{"$nulls":13},41112,"Warborough","Draw","Home",{"$f":"$D$24","v":"S. Beardall"},"First",248,6,110,4,38,45,14,5,{"$f":"F8","v":2},"J. Rogers",8,1,{"$f":"(IF(AD4>49,1,0))-AG4","v":0},{"$f":"IF(AD4>99,1,0)","v":0},{"$f":"F25","v":2},"N. Henry",10,2,0,29]
[null,null,"Date","2012-07-22",null,"Batting ",{"$nulls":7},41112,"Warborough","Draw","Home","S. Beardall","First",248,6,110,4,38,45,14,5,3,"S. Beardall",76,1,1,0,3,"S. Flakelar",8,0,0,14]
[{"$nulls":5},"Position","Name","Runs","Out",{"$nulls":4},41112,"Warborough","Draw","Home","S. Beardall","First",248,6,110,4,38,45,14,5,4,"S. Flakelar",19,1,0,0,4,"C. Rogers",3,1,0,14]
[null,null,"Opposition","Warborough",null,1,"C. Beardall",96,1,{"$nulls":4},41112,"Warborough","Draw","Home","S. Beardall","First",248,6,110,4,38,45,14,5,5,"T. Wade",16,0,0,0,5,"J. Rogers",6,1,2,7]
[{"$nulls":5},2,"J. Rogers",8,1,{"$nulls":4},41112,"Warborough","Draw","Home","S. Beardall","First",248,6,110,4,38,45,14,5,6,"J. Moberly",13,1,0,0,6,"S. Beardall",2,1,0,5]
[null,null,"Match Status","Draw",null,3,"S. Beardall",76,1,{"$nulls":4},41112,"Warborough","Draw","Home","S. Beardall","First",248,6,110,4,38,45,14,5,7,"C. Rogers",3,1,0,0,7,"T. Greenwood",1,0,0,5]
[{"$nulls":5},4,"S. Flakelar",19,1,{"$nulls":4},41112,"Warborough","Draw","Home","S. Beardall","First",248,6,110,4,38,45,14,5,8,"J. Leefe",3,0,0,0,8,0,0,0,0,0]
[null,null,"Home / Away","Home",null,5,"T. Wade",16,0,{"$nulls":4},41112,"Warborough","Draw","Home","S. Beardall","First",248,6,110,4,38,45,14,5,9,0,0,0,0,0,9,0,0,0,0,0]
[{"$nulls":5},6,"J. Moberly",13,1,{"$nulls":4},41112,"Warborough","Draw","Home","S. Beardall","First",248,6,110,4,38,45,14,5,10,0,0,0,0,0,10,0,0,0,0,0]
[null,null,"TPCC Batting First","First",null,7,"C. Rogers",3,1,{"$nulls":4},41112,"Warborough","Draw","Home","S. Beardall","First",248,6,110,4,38,45,14,5,11,0,0,0,0,0,11,0,0,0,0,0]
[{"$nulls":5},8,"J. Leefe",3,0]
[null,null,"TPCC Team Score",{"$f":"SUM(H7:H17)+H19","v":248},null,9]
[null,null,"TPCC Team Wickets",{"$f":"SUM(I7:I17)","v":6},null,10]
[{"$nulls":5},11]
[null,null,"Opposition Team Score",{"$f":"SUM(K24:K34)+H36","v":110}]
[null,null,"Opposition Team Wickets",{"$f":"SUM(J24:J34)","v":4},null,"Batting Extras",null,14]
[]
[null,null,"TPCC Overs Bowled",{"$f":"SUM(H24:H34)","v":38}]
[null,null,"Opposition Overs Bowled",45,null,"Bowling"]
[{"$nulls":5},"Position","Name","Overs","Maidens","Wickets","Runs"]
[null,null,"TPCC Captain","S. Beardall",null,1,"J. Leefe",8,0,2,31]
[{"$nulls":5},2,"N. Henry",10,2,0,29]
[{"$nulls":5},3,"S. Flakelar",8,0,0,14]
[{"$nulls":5},4,"C. Rogers",3,1,0,14]
[{"$nulls":5},5,"J. Rogers",6,1,2,7]
[{"$nulls":5},6,"S. Beardall",2,1,0,5]
[{"$nulls":5},7,"T. Greenwood",1,0,0,5]
[{"$nulls":5},8]
[{"$nulls":5},9]
[{"$nulls":5},10]
[{"$nulls":5},11]
[]
[{"$nulls":5},"Bowling Extras",null,5]

{"sheet":"Ipsden","index":25,"n_rows":36,"n_cols":39,"rows_kept":36,"merged":[[2,2,2,10],[4,5,4,8],[21,5,21,10]]}
[]
[{"$nulls":13},"Date","Opposition","Match Status","Home/Away","Captain","TPCC Batting First","TPCC Team Score","TPCC Team Wickets","Opposition Team Score","Opposition Team Wickets","TPCC Overs Bowled","TPCC Overs Faced","Batting Extras","Bowling Extras","Batsmen Position","Batsmen Name","Batsmen Runs","Batsmen Out",50,100,"Bowler Position","Bowler Name","Bowler Overs","Bowler Maidens","Bowler Wickets","Bowler Runs"]
[null,null,"Match Overview",{"$nulls":10},{"$f":"$D$5","v":41119},{"$f":"$D$7","v":"Ipsden"},{"$f":"$D$9","v":"Win"},{"$f":"$D$11","v":"Home"},{"$f":"$D$24","v":"S. Beardall"},{"$f":"$D$13","v":"First"},{"$f":"$D$15","v":180},{"$f":"$D$16","v":3},{"$f":"$D$18","v":178},{"$f":"$D$19","v":4},{"$f":"$D$21","v":30},{"$f":"$D$22","v":30},{"$f":"$H$19","v":8},{"$f":"$H$36","v":4},{"$f":"F7","v":1},{"$f":"G7","v":"C. Beardall"},{"$f":"H7","v":26},{"$f":"I7","v":1},{"$f":"(IF(AD3>49,1,0))-AG3","v":0},{"$f":"IF(AD3>99,1,0)","v":0},{"$f":"F24","v":1},{"$f":"G24","v":"S. Beardall"},6,0,1,18]
[{"$nulls":13},41119,"Ipsden","Win","Home",{"$f":"$D$24","v":"S. Beardall"},"First",180,3,178,4,30,30,8,4,{"$f":"F8","v":2},"J. Rogers",24,1,{"$f":"(IF(AD4>49,1,0))-AG4","v":0},{"$f":"IF(AD4>99,1,0)","v":0},{"$f":"F25","v":2},"N. Henry",7,0,1,23]
[null,null,"Date","2012-07-29",null,"Batting ",{"$nulls":7},41119,"Ipsden","Win","Home","S. Beardall","First",180,3,178,4,30,30,8,4,3,"O. Thornton",103,0,0,1,3,"B. Watson",5,2,1,24]
[{"$nulls":5},"Position","Name","Runs","Out",{"$nulls":4},41119,"Ipsden","Win","Home","S. Beardall","First",180,3,178,4,30,30,8,4,4,"B. Watson",19,1,0,0,4,"C. Rogers",3,0,0,30]
[null,null,"Opposition","Ipsden",null,1,"C. Beardall",26,1,{"$nulls":4},41119,"Ipsden","Win","Home","S. Beardall","First",180,3,178,4,30,30,8,4,5,"T. Wade",0,0,0,0,5,"J. Rogers",4,0,0,38]
[{"$nulls":5},2,"J. Rogers",24,1,{"$nulls":4},41119,"Ipsden","Win","Home","S. Beardall","First",180,3,178,4,30,30,8,4,6,0,0,0,0,0,6,"C. Henry",2,0,0,25]
[null,null,"Match Status","Win",null,3,"O. Thornton",103,0,{"$nulls":4},41119,"Ipsden","Win","Home","S. Beardall","First",180,3,178,4,30,30,8,4,7,0,0,0,0,0,7,"O. Thornton",3,0,1,16]
[{"$nulls":5},4,"B. Watson",19,1,{"$nulls":4},41119,"Ipsden","Win","Home","S. Beardall","First",180,3,178,4,30,30,8,4,8,0,0,0,0,0,8,0,0,0,0,0]
[null,null,"Home / Away","Home",null,5,"T. Wade",0,0,{"$nulls":4},41119,"Ipsden","Win","Home","S. Beardall","First",180,3,178,4,30,30,8,4,9,0,0,0,0,0,9,0,0,0,0,0]
[{"$nulls":5},6,{"$nulls":7},41119,"Ipsden","Win","Home","S. Beardall","First",180,3,178,4,30,30,8,4,10,0,0,0,0,0,10,0,0,0,0,0]
[null,null,"TPCC Batting First","First",null,7,{"$nulls":7},41119,"Ipsden","Win","Home","S. Beardall","First",180,3,178,4,30,30,8,4,11,0,0,0,0,0,11,0,0,0,0,0]
[{"$nulls":5},8]
[null,null,"TPCC Team Score",{"$f":"SUM(H7:H17)+H19","v":180},null,9]
[null,null,"TPCC Team Wickets",{"$f":"SUM(I7:I17)","v":3},null,10]
[{"$nulls":5},11]
[null,null,"Opposition Team Score",{"$f":"SUM(K24:K34)+H36","v":178}]
[null,null,"Opposition Team Wickets",{"$f":"SUM(J24:J34)","v":4},null,"Batting Extras",null,8]
[]
[null,null,"TPCC Overs Bowled",{"$f":"SUM(H24:H34)","v":30}]
[null,null,"Opposition Overs Bowled",30,null,"Bowling"]
[{"$nulls":5},"Position","Name","Overs","Maidens","Wickets","Runs"]
[null,null,"TPCC Captain","S. Beardall",null,1,"S. Beardall",6,0,1,18]
[{"$nulls":5},2,"N. Henry",7,0,1,23]
[{"$nulls":5},3,"B. Watson",5,2,1,24]
[{"$nulls":5},4,"C. Rogers",3,0,0,30]
[{"$nulls":5},5,"J. Rogers",4,0,0,38]
[{"$nulls":5},6,"C. Henry",2,0,0,25]
[{"$nulls":5},7,"O. Thornton",3,0,1,16]
[{"$nulls":5},8]
[{"$nulls":5},9]
[{"$nulls":5},10]
[{"$nulls":5},11]
[]
[{"$nulls":5},"Bowling Extras",null,4]

{"sheet":"Henley","index":26,"n_rows":36,"n_cols":39,"rows_kept":36,"merged":[[2,2,2,10],[4,5,4,8],[21,5,21,10]]}
[]
[{"$nulls":13},"Date","Opposition","Match Status","Home/Away","Captain","TPCC Batting First","TPCC Team Score","TPCC Team Wickets","Opposition Team Score","Opposition Team Wickets","TPCC Overs Bowled","TPCC Overs Faced","Batting Extras","Bowling Extras","Batsmen Position","Batsmen Name","Batsmen Runs","Batsmen Out",50,100,"Bowler Position","Bowler Name","Bowler Overs","Bowler Maidens","Bowler Wickets","Bowler Runs"]
[null,null,"Match Overview",{"$nulls":10},{"$f":"$D$5","v":41126},{"$f":"$D$7","v":"Henley"},{"$f":"$D$9","v":"Win"},{"$f":"$D$11","v":"Away"},{"$f":"$D$24","v":"S. Beardall"},{"$f":"$D$13","v":"First"},{"$f":"$D$15","v":212},{"$f":"$D$16","v":10},{"$f":"$D$18","v":94},{"$f":"$D$19","v":8},{"$f":"$D$21","v":28},{"$f":"$D$22","v":40},{"$f":"$H$19","v":20},{"$f":"$H$36","v":0},{"$f":"F7","v":1},{"$f":"G7","v":"J. Hunt"},{"$f":"H7","v":11},{"$f":"I7","v":1},{"$f":"(IF(AD3>49,1,0))-AG3","v":0},{"$f":"IF(AD3>99,1,0)","v":0},{"$f":"F24","v":1},{"$f":"G24","v":"T. White"},6,0,2,22]
[{"$nulls":13},41126,"Henley","Win","Away",{"$f":"$D$24","v":"S. Beardall"},"First",212,10,94,8,28,40,20,0,{"$f":"F8","v":2},"J. Moberly",30,1,{"$f":"(IF(AD4>49,1,0))-AG4","v":0},{"$f":"IF(AD4>99,1,0)","v":0},{"$f":"F25","v":2},"J. Thornton",7,0,1,32]
[null,null,"Date","2012-08-05",null,"Batting ",{"$nulls":7},41126,"Henley","Win","Away","S. Beardall","First",212,10,94,8,28,40,20,0,3,"O. Thornton",1,1,0,0,3,"J. Hancock",5,0,2,9]
[{"$nulls":5},"Position","Name","Runs","Out",{"$nulls":4},41126,"Henley","Win","Away","S. Beardall","First",212,10,94,8,28,40,20,0,4,"J. Hancock",36,1,0,0,4,"N. Henry",8,0,2,29]
[null,null,"Opposition","Henley",null,1,"J. Hunt",11,1,{"$nulls":4},41126,"Henley","Win","Away","S. Beardall","First",212,10,94,8,28,40,20,0,5,"S. Beardall",63,1,1,0,5,"J. Hunt",2,1,1,2]
[{"$nulls":5},2,"J. Moberly",30,1,{"$nulls":4},41126,"Henley","Win","Away","S. Beardall","First",212,10,94,8,28,40,20,0,6,"C. Beardall",31,1,0,0,6,0,0,0,0,0]
[null,null,"Match Status","Win",null,3,"O. Thornton",1,1,{"$nulls":4},41126,"Henley","Win","Away","S. Beardall","First",212,10,94,8,28,40,20,0,7,"Ro. Dickie",6,1,0,0,7,0,0,0,0,0]
[{"$nulls":5},4,"J. Hancock",36,1,{"$nulls":4},41126,"Henley","Win","Away","S. Beardall","First",212,10,94,8,28,40,20,0,8,"J. Thornton",5,1,0,0,8,0,0,0,0,0]
[null,null,"Home / Away","Away",null,5,"S. Beardall",63,1,{"$nulls":4},41126,"Henley","Win","Away","S. Beardall","First",212,10,94,8,28,40,20,0,9,"S. Halfhead",6,1,0,0,9,0,0,0,0,0]
[{"$nulls":5},6,"C. Beardall",31,1,{"$nulls":4},41126,"Henley","Win","Away","S. Beardall","First",212,10,94,8,28,40,20,0,10,"N. Henry",2,1,0,0,10,0,0,0,0,0]
[null,null,"TPCC Batting First","First",null,7,"Ro. Dickie",6,1,{"$nulls":4},41126,"Henley","Win","Away","S. Beardall","First",212,10,94,8,28,40,20,0,11,"T. White",1,0,0,0,11,0,0,0,0,0]
[{"$nulls":5},8,"J. Thornton",5,1]
[null,null,"TPCC Team Score",{"$f":"SUM(H7:H17)+H19","v":212},null,9,"S. Halfhead",6,1]
[null,null,"TPCC Team Wickets",{"$f":"SUM(I7:I17)","v":10},null,10,"N. Henry",2,1]
[{"$nulls":5},11,"T. White",1,0]
[null,null,"Opposition Team Score",{"$f":"SUM(K24:K34)+H36","v":94}]
[null,null,"Opposition Team Wickets",{"$f":"SUM(J24:J34)","v":8},null,"Batting Extras",null,20]
[]
[null,null,"TPCC Overs Bowled",{"$f":"SUM(H24:H34)","v":28}]
[null,null,"Opposition Overs Bowled",40,null,"Bowling"]
[{"$nulls":5},"Position","Name","Overs","Maidens","Wickets","Runs"]
[null,null,"TPCC Captain","S. Beardall",null,1,"T. White",6,0,2,22]
[{"$nulls":5},2,"J. Thornton",7,0,1,32]
[{"$nulls":5},3,"J. Hancock",5,0,2,9]
[{"$nulls":5},4,"N. Henry",8,0,2,29]
[{"$nulls":5},5,"J. Hunt",2,1,1,2]
[{"$nulls":5},6]
[{"$nulls":5},7]
[{"$nulls":5},8]
[{"$nulls":5},9]
[{"$nulls":5},10]
[{"$nulls":5},11]
[]
[{"$nulls":5},"Bowling Extras",null,0]

{"sheet":"West Wycombe","index":27,"n_rows":36,"n_cols":39,"rows_kept":36,"merged":[[2,2,2,10],[4,5,4,8],[21,5,21,10]]}
[]
[{"$nulls":13},"Date","Opposition","Match Status","Home/Away","Captain","TPCC Batting First","TPCC Team Score","TPCC Team Wickets","Opposition Team Score","Opposition Team Wickets","TPCC Overs Bowled","TPCC Overs Faced","Batting Extras","Bowling Extras","Batsmen Position","Batsmen Name","Batsmen Runs","Batsmen Out",50,100,"Bowler Position","Bowler Name","Bowler Overs","Bowler Maidens","Bowler Wickets","Bowler Runs"]
[null,null,"Match Overview",{"$nulls":10},{"$f":"$D$5","v":41132},{"$f":"$D$7","v":"West Wycombe"},{"$f":"$D$9","v":"Cancelled (Opposition)"},{"$f":"$D$11","v":"Home"},{"$f":"$D$24","v":0},{"$f":"$D$13","v":0},{"$f":"$D$15","v":0},{"$f":"$D$16","v":0},{"$f":"$D$18","v":0},{"$f":"$D$19","v":0},{"$f":"$D$21","v":0},{"$f":"$D$22","v":0},{"$f":"$H$19","v":0},{"$f":"$H$36","v":0},{"$f":"F7","v":1},{"$f":"G7","v":0},{"$f":"H7","v":0},{"$f":"I7","v":0},{"$f":"(IF(AD3>49,1,0))-AG3","v":0},{"$f":"IF(AD3>99,1,0)","v":0},{"$f":"F24","v":1},{"$f":"G24","v":0},0,0,0,0]
[{"$nulls":13},41132,"West Wycombe","Cancelled (Opposition)","Home",{"$f":"$D$24","v":0},0,0,0,0,0,0,0,0,0,{"$f":"F8","v":2},0,0,0,{"$f":"(IF(AD4>49,1,0))-AG4","v":0},{"$f":"IF(AD4>99,1,0)","v":0},{"$f":"F25","v":2},0,0,0,0,0]
[null,null,"Date","2012-08-11",null,"Batting ",{"$nulls":7},41132,"West Wycombe","Cancelled (Opposition)","Home",0,0,0,0,0,0,0,0,0,0,3,0,0,0,0,0,3,0,0,0,0,0]
[{"$nulls":5},"Position","Name","Runs","Out",{"$nulls":4},41132,"West Wycombe","Cancelled (Opposition)","Home",0,0,0,0,0,0,0,0,0,0,4,0,0,0,0,0,4,0,0,0,0,0]
[null,null,"Opposition","West Wycombe",null,1,{"$nulls":7},41132,"West Wycombe","Cancelled (Opposition)","Home",0,0,0,0,0,0,0,0,0,0,5,0,0,0,0,0,5,0,0,0,0,0]
[{"$nulls":5},2,{"$nulls":7},41132,"West Wycombe","Cancelled (Opposition)","Home",0,0,0,0,0,0,0,0,0,0,6,0,0,0,0,0,6,0,0,0,0,0]
[null,null,"Match Status","Cancelled (Opposition)",null,3,{"$nulls":7},41132,"West Wycombe","Cancelled (Opposition)","Home",0,0,0,0,0,0,0,0,0,0,7,0,0,0,0,0,7,0,0,0,0,0]
[{"$nulls":5},4,{"$nulls":7},41132,"West Wycombe","Cancelled (Opposition)","Home",0,0,0,0,0,0,0,0,0,0,8,0,0,0,0,0,8,0,0,0,0,0]
[null,null,"Home / Away","Home",null,5,{"$nulls":7},41132,"West Wycombe","Cancelled (Opposition)","Home",0,0,0,0,0,0,0,0,0,0,9,0,0,0,0,0,9,0,0,0,0,0]
[{"$nulls":5},6,{"$nulls":7},41132,"West Wycombe","Cancelled (Opposition)","Home",0,0,0,0,0,0,0,0,0,0,10,0,0,0,0,0,10,0,0,0,0,0]
[null,null,"TPCC Batting First",null,null,7,{"$nulls":7},41132,"West Wycombe","Cancelled (Opposition)","Home",0,0,0,0,0,0,0,0,0,0,11,0,0,0,0,0,11,0,0,0,0,0]
[{"$nulls":5},8]
[null,null,"TPCC Team Score",{"$f":"SUM(H7:H17)+H19","v":0},null,9]
[null,null,"TPCC Team Wickets",{"$f":"SUM(I7:I17)","v":0},null,10]
[{"$nulls":5},11]
[null,null,"Opposition Team Score",{"$f":"SUM(K24:K34)+H36","v":0}]
[null,null,"Opposition Team Wickets",{"$f":"SUM(J24:J34)","v":0},null,"Batting Extras"]
[]
[null,null,"TPCC Overs Bowled",{"$f":"SUM(H24:H34)","v":0}]
[null,null,"Opposition Overs Bowled",null,null,"Bowling"]
[{"$nulls":5},"Position","Name","Overs","Maidens","Wickets","Runs"]
[null,null,"TPCC Captain",null,null,1]
[{"$nulls":5},2]
[{"$nulls":5},3]
[{"$nulls":5},4]
[{"$nulls":5},5]
[{"$nulls":5},6]
[{"$nulls":5},7]
[{"$nulls":5},8]
[{"$nulls":5},9]
[{"$nulls":5},10]
[{"$nulls":5},11]
[]
[{"$nulls":5},"Bowling Extras"]

{"sheet":"Dorchester","index":28,"n_rows":36,"n_cols":39,"rows_kept":36,"merged":[[2,2,2,10],[4,5,4,8],[21,5,21,10]]}
[]
[{"$nulls":13},"Date","Opposition","Match Status","Home/Away","Captain","TPCC Batting First","TPCC Team Score","TPCC Team Wickets","Opposition Team Score","Opposition Team Wickets","TPCC Overs Bowled","TPCC Overs Faced","Batting Extras","Bowling Extras","Batsmen Position","Batsmen Name","Batsmen Runs","Batsmen Out",50,100,"Bowler Position","Bowler Name","Bowler Overs","Bowler Maidens","Bowler Wickets","Bowler Runs"]
[null,null,"Match Overview",{"$nulls":10},{"$f":"$D$5","v":41133},{"$f":"$D$7","v":"Dorchester"},{"$f":"$D$9","v":"Win"},{"$f":"$D$11","v":"Home"},{"$f":"$D$24","v":"S. Beardall"},{"$f":"$D$13","v":"Second"},{"$f":"$D$15","v":213},{"$f":"$D$16","v":5},{"$f":"$D$18","v":212},{"$f":"$D$19","v":6},{"$f":"$D$21","v":46},{"$f":"$D$22","v":38},{"$f":"$H$19","v":5},{"$f":"$H$36","v":0},{"$f":"F7","v":1},{"$f":"G7","v":"S. Beardall"},{"$f":"H7","v":86},{"$f":"I7","v":1},{"$f":"(IF(AD3>49,1,0))-AG3","v":1},{"$f":"IF(AD3>99,1,0)","v":0},{"$f":"F24","v":1},{"$f":"G24","v":"J. Thornton"},9,3,0,29]
[{"$nulls":13},41133,"Dorchester","Win","Home",{"$f":"$D$24","v":"S. Beardall"},"Second",213,5,212,6,46,38,5,0,{"$f":"F8","v":2},"Ro. Dickie",15,1,{"$f":"(IF(AD4>49,1,0))-AG4","v":0},{"$f":"IF(AD4>99,1,0)","v":0},{"$f":"F25","v":2},"N. Henry",14,1,0,68]
[null,null,"Date","2012-08-12",null,"Batting ",{"$nulls":7},41133,"Dorchester","Win","Home","S. Beardall","Second",213,5,212,6,46,38,5,0,3,"N. Phillips",1,1,0,0,3,"J. Crook",7,0,1,49]
[{"$nulls":5},"Position","Name","Runs","Out",{"$nulls":4},41133,"Dorchester","Win","Home","S. Beardall","Second",213,5,212,6,46,38,5,0,4,"P. De Zulueta",43,1,0,0,4,"S. Beardall",4,0,4,22]
[null,null,"Opposition","Dorchester",null,1,"S. Beardall",86,1,{"$nulls":4},41133,"Dorchester","Win","Home","S. Beardall","Second",213,5,212,6,46,38,5,0,5,"J. Crook",0,1,0,0,5,"C. Henry",7,3,0,26]
[{"$nulls":5},2,"Ro. Dickie",15,1,{"$nulls":4},41133,"Dorchester","Win","Home","S. Beardall","Second",213,5,212,6,46,38,5,0,6,"J. Thornton",51,0,1,0,6,"Ra. Dickie",5,1,0,18]
[null,null,"Match Status","Win",null,3,"N. Phillips",1,1,{"$nulls":4},41133,"Dorchester","Win","Home","S. Beardall","Second",213,5,212,6,46,38,5,0,7,"S. Halfhead",12,0,0,0,7,"Run Out",0,0,1,0]
[{"$nulls":5},4,"P. De Zulueta",43,1,{"$nulls":4},41133,"Dorchester","Win","Home","S. Beardall","Second",213,5,212,6,46,38,5,0,8,0,0,0,0,0,8,0,0,0,0,0]
[null,null,"Home / Away","Home",null,5,"J. Crook",0,1,{"$nulls":4},41133,"Dorchester","Win","Home","S. Beardall","Second",213,5,212,6,46,38,5,0,9,0,0,0,0,0,9,0,0,0,0,0]
[{"$nulls":5},6,"J. Thornton",51,0,{"$nulls":4},41133,"Dorchester","Win","Home","S. Beardall","Second",213,5,212,6,46,38,5,0,10,0,0,0,0,0,10,0,0,0,0,0]
[null,null,"TPCC Batting First","Second",null,7,"S. Halfhead",12,0,{"$nulls":4},41133,"Dorchester","Win","Home","S. Beardall","Second",213,5,212,6,46,38,5,0,11,0,0,0,0,0,11,0,0,0,0,0]
[{"$nulls":5},8]
[null,null,"TPCC Team Score",{"$f":"SUM(H7:H17)+H19","v":213},null,9]
[null,null,"TPCC Team Wickets",{"$f":"SUM(I7:I17)","v":5},null,10]
[{"$nulls":5},11]
[null,null,"Opposition Team Score",{"$f":"SUM(K24:K34)+H36","v":212}]
[null,null,"Opposition Team Wickets",{"$f":"SUM(J24:J34)","v":6},null,"Batting Extras",null,5]
[]
[null,null,"TPCC Overs Bowled",{"$f":"SUM(H24:H34)","v":46}]
[null,null,"Opposition Overs Bowled",38,null,"Bowling"]
[{"$nulls":5},"Position","Name","Overs","Maidens","Wickets","Runs"]
[null,null,"TPCC Captain","S. Beardall",null,1,"J. Thornton",9,3,0,29]
[{"$nulls":5},2,"N. Henry",14,1,0,68]
[{"$nulls":5},3,"J. Crook",7,0,1,49]
[{"$nulls":5},4,"S. Beardall",4,0,4,22]
[{"$nulls":5},5,"C. Henry",7,3,0,26]
[{"$nulls":5},6,"Ra. Dickie",5,1,0,18]
[{"$nulls":5},7,"Run Out",0,0,1,0]
[{"$nulls":5},8]
[{"$nulls":5},9]
[{"$nulls":5},10]
[{"$nulls":5},11]
[]
[{"$nulls":5},"Bowling Extras",null,0]

{"sheet":"Odney","index":29,"n_rows":36,"n_cols":39,"rows_kept":36,"merged":[[2,2,2,10],[4,5,4,8],[21,5,21,10]]}
[]
[{"$nulls":13},"Date","Opposition","Match Status","Home/Away","Captain","TPCC Batting First","TPCC Team Score","TPCC Team Wickets","Opposition Team Score","Opposition Team Wickets","TPCC Overs Bowled","TPCC Overs Faced","Batting Extras","Bowling Extras","Batsmen Position","Batsmen Name","Batsmen Runs","Batsmen Out",50,100,"Bowler Position","Bowler Name","Bowler Overs","Bowler Maidens","Bowler Wickets","Bowler Runs"]
[null,null,"Match Overview",{"$nulls":10},{"$f":"$D$5","v":41140},{"$f":"$D$7","v":"Odney"},{"$f":"$D$9","v":"Draw"},{"$f":"$D$11","v":"Home"},{"$f":"$D$24","v":"S. Beardall"},{"$f":"$D$13","v":"Second"},{"$f":"$D$15","v":113},{"$f":"$D$16","v":5},{"$f":"$D$18","v":181},{"$f":"$D$19","v":10},{"$f":"$D$21","v":37},{"$f":"$D$22","v":34},{"$f":"$H$19","v":17},{"$f":"$H$36","v":6},{"$f":"F7","v":1},{"$f":"G7","v":"S. Beardall"},{"$f":"H7","v":6},{"$f":"I7","v":1},{"$f":"(IF(AD3>49,1,0))-AG3","v":0},{"$f":"IF(AD3>99,1,0)","v":0},{"$f":"F24","v":1},{"$f":"G24","v":"J. Leefe"},8,0,3,32]
[{"$nulls":13},41140,"Odney","Draw","Home",{"$f":"$D$24","v":"S. Beardall"},"Second",113,5,181,10,37,34,17,6,{"$f":"F8","v":2},"Ro. Dickie",6,1,{"$f":"(IF(AD4>49,1,0))-AG4","v":0},{"$f":"IF(AD4>99,1,0)","v":0},{"$f":"F25","v":2},"O. Thornton",5,0,0,15]
[null,null,"Date","2012-08-19",null,"Batting ",{"$nulls":7},41140,"Odney","Draw","Home","S. Beardall","Second",113,5,181,10,37,34,17,6,3,"O. Thornton",37,1,0,0,3,"N. Henry",8,0,1,54]
[{"$nulls":5},"Position","Name","Runs","Out",{"$nulls":4},41140,"Odney","Draw","Home","S. Beardall","Second",113,5,181,10,37,34,17,6,4,"P. Briffett",1,1,0,0,4,"N. Runkel",11,0,6,40]
[null,null,"Opposition","Odney",null,1,"S. Beardall",6,1,{"$nulls":4},41140,"Odney","Draw","Home","S. Beardall","Second",113,5,181,10,37,34,17,6,5,"J. Leefe",20,0,0,0,5,"C. Henry",4,0,0,29]
[{"$nulls":5},2,"Ro. Dickie",6,1,{"$nulls":4},41140,"Odney","Draw","Home","S. Beardall","Second",113,5,181,10,37,34,17,6,6,"N. Henry",21,1,0,0,6,"S. Beardall",1,0,0,5]
[null,null,"Match Status","Draw",null,3,"O. Thornton",37,1,{"$nulls":4},41140,"Odney","Draw","Home","S. Beardall","Second",113,5,181,10,37,34,17,6,7,"B. Bazell",5,0,0,0,7,0,0,0,0,0]
[{"$nulls":5},4,"P. Briffett",1,1,{"$nulls":4},41140,"Odney","Draw","Home","S. Beardall","Second",113,5,181,10,37,34,17,6,8,0,0,0,0,0,8,0,0,0,0,0]
[null,null,"Home / Away","Home",null,5,"J. Leefe",20,0,{"$nulls":4},41140,"Odney","Draw","Home","S. Beardall","Second",113,5,181,10,37,34,17,6,9,0,0,0,0,0,9,0,0,0,0,0]
[{"$nulls":5},6,"N. Henry",21,1,{"$nulls":4},41140,"Odney","Draw","Home","S. Beardall","Second",113,5,181,10,37,34,17,6,10,0,0,0,0,0,10,0,0,0,0,0]
[null,null,"TPCC Batting First","Second",null,7,"B. Bazell",5,0,{"$nulls":4},41140,"Odney","Draw","Home","S. Beardall","Second",113,5,181,10,37,34,17,6,11,0,0,0,0,0,11,0,0,0,0,0]
[{"$nulls":5},8]
[null,null,"TPCC Team Score",{"$f":"SUM(H7:H17)+H19","v":113},null,9]
[null,null,"TPCC Team Wickets",{"$f":"SUM(I7:I17)","v":5},null,10]
[{"$nulls":5},11]
[null,null,"Opposition Team Score",{"$f":"SUM(K24:K34)+H36","v":181}]
[null,null,"Opposition Team Wickets",{"$f":"SUM(J24:J34)","v":10},null,"Batting Extras",null,17]
[]
[null,null,"TPCC Overs Bowled",{"$f":"SUM(H24:H34)","v":37}]
[null,null,"Opposition Overs Bowled",34,null,"Bowling"]
[{"$nulls":5},"Position","Name","Overs","Maidens","Wickets","Runs"]
[null,null,"TPCC Captain","S. Beardall",null,1,"J. Leefe",8,0,3,32]
[{"$nulls":5},2,"O. Thornton",5,0,0,15]
[{"$nulls":5},3,"N. Henry",8,0,1,54]
[{"$nulls":5},4,"N. Runkel",11,0,6,40]
[{"$nulls":5},5,"C. Henry",4,0,0,29]
[{"$nulls":5},6,"S. Beardall",1,0,0,5]
[{"$nulls":5},7]
[{"$nulls":5},8]
[{"$nulls":5},9]
[{"$nulls":5},10]
[{"$nulls":5},11]
[]
[{"$nulls":5},"Bowling Extras",null,6]

{"sheet":"Stonor (2)","index":30,"n_rows":36,"n_cols":39,"rows_kept":36,"merged":[[2,2,2,10],[4,5,4,8],[21,5,21,10]]}
[]
[{"$nulls":13},"Date","Opposition","Match Status","Home/Away","Captain","TPCC Batting First","TPCC Team Score","TPCC Team Wickets","Opposition Team Score","Opposition Team Wickets","TPCC Overs Bowled","TPCC Overs Faced","Batting Extras","Bowling Extras","Batsmen Position","Batsmen Name","Batsmen Runs","Batsmen Out",50,100,"Bowler Position","Bowler Name","Bowler Overs","Bowler Maidens","Bowler Wickets","Bowler Runs"]
[null,null,"Match Overview",{"$nulls":10},{"$f":"$D$5","v":41146},{"$f":"$D$7","v":"Stonor (2)"},{"$f":"$D$9","v":"Cancelled (Rain)"},{"$f":"$D$11","v":"Home"},{"$f":"$D$24","v":0},{"$f":"$D$13","v":0},{"$f":"$D$15","v":0},{"$f":"$D$16","v":0},{"$f":"$D$18","v":0},{"$f":"$D$19","v":0},{"$f":"$D$21","v":0},{"$f":"$D$22","v":0},{"$f":"$H$19","v":0},{"$f":"$H$36","v":0},{"$f":"F7","v":1},{"$f":"G7","v":0},{"$f":"H7","v":0},{"$f":"I7","v":0},{"$f":"(IF(AD3>49,1,0))-AG3","v":0},{"$f":"IF(AD3>99,1,0)","v":0},{"$f":"F24","v":1},{"$f":"G24","v":0},0,0,0,0]
[{"$nulls":13},41146,"Stonor (2)","Cancelled (Rain)","Home",{"$f":"$D$24","v":0},0,0,0,0,0,0,0,0,0,{"$f":"F8","v":2},0,0,0,{"$f":"(IF(AD4>49,1,0))-AG4","v":0},{"$f":"IF(AD4>99,1,0)","v":0},{"$f":"F25","v":2},0,0,0,0,0]
[null,null,"Date","2012-08-25",null,"Batting ",{"$nulls":7},41146,"Stonor (2)","Cancelled (Rain)","Home",0,0,0,0,0,0,0,0,0,0,3,0,0,0,0,0,3,0,0,0,0,0]
[{"$nulls":5},"Position","Name","Runs","Out",{"$nulls":4},41146,"Stonor (2)","Cancelled (Rain)","Home",0,0,0,0,0,0,0,0,0,0,4,0,0,0,0,0,4,0,0,0,0,0]
[null,null,"Opposition","Stonor (2)",null,1,{"$nulls":7},41146,"Stonor (2)","Cancelled (Rain)","Home",0,0,0,0,0,0,0,0,0,0,5,0,0,0,0,0,5,0,0,0,0,0]
[{"$nulls":5},2,{"$nulls":7},41146,"Stonor (2)","Cancelled (Rain)","Home",0,0,0,0,0,0,0,0,0,0,6,0,0,0,0,0,6,0,0,0,0,0]
[null,null,"Match Status","Cancelled (Rain)",null,3,{"$nulls":7},41146,"Stonor (2)","Cancelled (Rain)","Home",0,0,0,0,0,0,0,0,0,0,7,0,0,0,0,0,7,0,0,0,0,0]
[{"$nulls":5},4,{"$nulls":7},41146,"Stonor (2)","Cancelled (Rain)","Home",0,0,0,0,0,0,0,0,0,0,8,0,0,0,0,0,8,0,0,0,0,0]
[null,null,"Home / Away","Home",null,5,{"$nulls":7},41146,"Stonor (2)","Cancelled (Rain)","Home",0,0,0,0,0,0,0,0,0,0,9,0,0,0,0,0,9,0,0,0,0,0]
[{"$nulls":5},6,{"$nulls":7},41146,"Stonor (2)","Cancelled (Rain)","Home",0,0,0,0,0,0,0,0,0,0,10,0,0,0,0,0,10,0,0,0,0,0]
[null,null,"TPCC Batting First",null,null,7,{"$nulls":7},41146,"Stonor (2)","Cancelled (Rain)","Home",0,0,0,0,0,0,0,0,0,0,11,0,0,0,0,0,11,0,0,0,0,0]
[{"$nulls":5},8]
[null,null,"TPCC Team Score",{"$f":"SUM(H7:H17)+H19","v":0},null,9]
[null,null,"TPCC Team Wickets",{"$f":"SUM(I7:I17)","v":0},null,10]
[{"$nulls":5},11]
[null,null,"Opposition Team Score",{"$f":"SUM(K24:K34)+H36","v":0}]
[null,null,"Opposition Team Wickets",{"$f":"SUM(J24:J34)","v":0},null,"Batting Extras"]
[]
[null,null,"TPCC Overs Bowled",{"$f":"SUM(H24:H34)","v":0}]
[null,null,"Opposition Overs Bowled",null,null,"Bowling"]
[{"$nulls":5},"Position","Name","Overs","Maidens","Wickets","Runs"]
[null,null,"TPCC Captain",null,null,1]
[{"$nulls":5},2]
[{"$nulls":5},3]
[{"$nulls":5},4]
[{"$nulls":5},5]
[{"$nulls":5},6]
[{"$nulls":5},7]
[{"$nulls":5},8]
[{"$nulls":5},9]
[{"$nulls":5},10]
[{"$nulls":5},11]
[]
[{"$nulls":5},"Bowling Extras"]

{"sheet":"VP Game","index":31,"n_rows":36,"n_cols":39,"rows_kept":36,"merged":[[2,2,2,10],[4,5,4,8],[21,5,21,10]]}
[]
[{"$nulls":13},"Date","Opposition","Match Status","Home/Away","Captain","TPCC Batting First","TPCC Team Score","TPCC Team Wickets","Opposition Team Score","Opposition Team Wickets","TPCC Overs Bowled","TPCC Overs Faced","Batting Extras","Bowling Extras","Batsmen Position","Batsmen Name","Batsmen Runs","Batsmen Out",50,100,"Bowler Position","Bowler Name","Bowler Overs","Bowler Maidens","Bowler Wickets","Bowler Runs"]
[null,null,"Match Overview",{"$nulls":10},{"$f":"$D$5","v":41153},{"$f":"$D$7","v":"VPs"},{"$f":"$D$9","v":"Loss"},{"$f":"$D$11","v":"Away"},{"$f":"$D$24","v":"S. Beardall"},{"$f":"$D$13","v":"Second"},{"$f":"$D$15","v":238},{"$f":"$D$16","v":8},{"$f":"$D$18","v":254},{"$f":"$D$19","v":4},{"$f":"$D$21","v":40},{"$f":"$D$22","v":40},{"$f":"$H$19","v":26},{"$f":"$H$36","v":14},{"$f":"F7","v":1},{"$f":"G7","v":"J. Hunt"},{"$f":"H7","v":98},{"$f":"I7","v":1},{"$f":"(IF(AD3>49,1,0))-AG3","v":1},{"$f":"IF(AD3>99,1,0)","v":0},{"$f":"F24","v":1},{"$f":"G24","v":"T. White"},7,1,0,37]
[{"$nulls":13},41153,"VPs","Loss","Away",{"$f":"$D$24","v":"S. Beardall"},"Second",238,8,254,4,40,40,26,14,{"$f":"F8","v":2},"P. Briffett",5,1,{"$f":"(IF(AD4>49,1,0))-AG4","v":0},{"$f":"IF(AD4>99,1,0)","v":0},{"$f":"F25","v":2},"H. De Zulueta",5,0,0,30]
[null,null,"Date","2012-09-01",null,"Batting ",{"$nulls":7},41153,"VPs","Loss","Away","S. Beardall","Second",238,8,254,4,40,40,26,14,3,"S. Beardall",1,1,0,0,3,"S. Flakelar",6,0,1,40]
[{"$nulls":5},"Position","Name","Runs","Out",{"$nulls":4},41153,"VPs","Loss","Away","S. Beardall","Second",238,8,254,4,40,40,26,14,4,"T. Wade",33,1,0,0,4,"J. Hunt",6,0,0,20]
[null,null,"Opposition","VPs",null,1,"J. Hunt",98,1,{"$nulls":4},41153,"VPs","Loss","Away","S. Beardall","Second",238,8,254,4,40,40,26,14,5,"P. De Zulueta",0,1,0,0,5,"N. Henry",5,0,0,40]
[{"$nulls":5},2,"P. Briffett",5,1,{"$nulls":4},41153,"VPs","Loss","Away","S. Beardall","Second",238,8,254,4,40,40,26,14,6,"J. Hancock",11,1,0,0,6,"J. Hancock",7,0,1,43]
[null,null,"Match Status","Loss",null,3,"S. Beardall",1,1,{"$nulls":4},41153,"VPs","Loss","Away","S. Beardall","Second",238,8,254,4,40,40,26,14,7,"S. Flakelar",25,0,0,0,7,"C. Henry",2,0,1,9]
[{"$nulls":5},4,"T. Wade",33,1,{"$nulls":4},41153,"VPs","Loss","Away","S. Beardall","Second",238,8,254,4,40,40,26,14,8,"T. White",10,1,0,0,8,"S. Beardall",2,0,1,21]
[null,null,"Home / Away","Away",null,5,"P. De Zulueta",0,1,{"$nulls":4},41153,"VPs","Loss","Away","S. Beardall","Second",238,8,254,4,40,40,26,14,9,"C. Henry",1,1,0,0,9,0,0,0,0,0]
[{"$nulls":5},6,"J. Hancock",11,1,{"$nulls":4},41153,"VPs","Loss","Away","S. Beardall","Second",238,8,254,4,40,40,26,14,10,"H. De Zulueta",28,0,0,0,10,0,0,0,0,0]
[null,null,"TPCC Batting First","Second",null,7,"S. Flakelar",25,0,{"$nulls":4},41153,"VPs","Loss","Away","S. Beardall","Second",238,8,254,4,40,40,26,14,11,0,0,0,0,0,11,0,0,0,0,0]
[{"$nulls":5},8,"T. White",10,1]
[null,null,"TPCC Team Score",{"$f":"SUM(H7:H17)+H19","v":238},null,9,"C. Henry",1,1]
[null,null,"TPCC Team Wickets",{"$f":"SUM(I7:I17)","v":8},null,10,"H. De Zulueta",28,0]
[{"$nulls":5},11]
[null,null,"Opposition Team Score",{"$f":"SUM(K24:K34)+H36","v":254}]
[null,null,"Opposition Team Wickets",{"$f":"SUM(J24:J34)","v":4},null,"Batting Extras",null,26]
[]
[null,null,"TPCC Overs Bowled",{"$f":"SUM(H24:H34)","v":40}]
[null,null,"Opposition Overs Bowled",40,null,"Bowling"]
[{"$nulls":5},"Position","Name","Overs","Maidens","Wickets","Runs"]
[null,null,"TPCC Captain","S. Beardall",null,1,"T. White",7,1,0,37]
[{"$nulls":5},2,"H. De Zulueta",5,0,0,30]
[{"$nulls":5},3,"S. Flakelar",6,0,1,40]
[{"$nulls":5},4,"J. Hunt",6,0,0,20]
[{"$nulls":5},5,"N. Henry",5,0,0,40]
[{"$nulls":5},6,"J. Hancock",7,0,1,43]
[{"$nulls":5},7,"C. Henry",2,0,1,9]
[{"$nulls":5},8,"S. Beardall",2,0,1,21]
[{"$nulls":5},9]
[{"$nulls":5},10]
[{"$nulls":5},11]
[]
[{"$nulls":5},"Bowling Extras",null,14]

{"sheet":"Medmenham","index":32,"n_rows":36,"n_cols":39,"rows_kept":36,"merged":[[2,2,2,10],[4,5,4,8],[21,5,21,10]]}
[]
[{"$nulls":13},"Date","Opposition","Match Status","Home/Away","Captain","TPCC Batting First","TPCC Team Score","TPCC Team Wickets","Opposition Team Score","Opposition Team Wickets","TPCC Overs Bowled","TPCC Overs Faced","Batting Extras","Bowling Extras","Batsmen Position","Batsmen Name","Batsmen Runs","Batsmen Out",50,100,"Bowler Position","Bowler Name","Bowler Overs","Bowler Maidens","Bowler Wickets","Bowler Runs"]
[null,null,"Match Overview",{"$nulls":10},{"$f":"$D$5","v":41154},{"$f":"$D$7","v":"Medmenham"},{"$f":"$D$9","v":"Cancelled (Turville)"},{"$f":"$D$11","v":"Home"},{"$f":"$D$24","v":0},{"$f":"$D$13","v":0},{"$f":"$D$15","v":0},{"$f":"$D$16","v":0},{"$f":"$D$18","v":0},{"$f":"$D$19","v":0},{"$f":"$D$21","v":0},{"$f":"$D$22","v":0},{"$f":"$H$19","v":0},{"$f":"$H$36","v":0},{"$f":"F7","v":1},{"$f":"G7","v":0},{"$f":"H7","v":0},{"$f":"I7","v":0},{"$f":"(IF(AD3>49,1,0))-AG3","v":0},{"$f":"IF(AD3>99,1,0)","v":0},{"$f":"F24","v":1},{"$f":"G24","v":0},0,0,0,0]
[{"$nulls":13},41154,"Medmenham","Cancelled (Turville)","Home",{"$f":"$D$24","v":0},0,0,0,0,0,0,0,0,0,{"$f":"F8","v":2},0,0,0,{"$f":"(IF(AD4>49,1,0))-AG4","v":0},{"$f":"IF(AD4>99,1,0)","v":0},{"$f":"F25","v":2},0,0,0,0,0]
[null,null,"Date","2012-09-02",null,"Batting ",{"$nulls":7},41154,"Medmenham","Cancelled (Turville)","Home",0,0,0,0,0,0,0,0,0,0,3,0,0,0,0,0,3,0,0,0,0,0]
[{"$nulls":5},"Position","Name","Runs","Out",{"$nulls":4},41154,"Medmenham","Cancelled (Turville)","Home",0,0,0,0,0,0,0,0,0,0,4,0,0,0,0,0,4,0,0,0,0,0]
[null,null,"Opposition","Medmenham",null,1,{"$nulls":7},41154,"Medmenham","Cancelled (Turville)","Home",0,0,0,0,0,0,0,0,0,0,5,0,0,0,0,0,5,0,0,0,0,0]
[{"$nulls":5},2,{"$nulls":7},41154,"Medmenham","Cancelled (Turville)","Home",0,0,0,0,0,0,0,0,0,0,6,0,0,0,0,0,6,0,0,0,0,0]
[null,null,"Match Status","Cancelled (Turville)",null,3,{"$nulls":7},41154,"Medmenham","Cancelled (Turville)","Home",0,0,0,0,0,0,0,0,0,0,7,0,0,0,0,0,7,0,0,0,0,0]
[{"$nulls":5},4,{"$nulls":7},41154,"Medmenham","Cancelled (Turville)","Home",0,0,0,0,0,0,0,0,0,0,8,0,0,0,0,0,8,0,0,0,0,0]
[null,null,"Home / Away","Home",null,5,{"$nulls":7},41154,"Medmenham","Cancelled (Turville)","Home",0,0,0,0,0,0,0,0,0,0,9,0,0,0,0,0,9,0,0,0,0,0]
[{"$nulls":5},6,{"$nulls":7},41154,"Medmenham","Cancelled (Turville)","Home",0,0,0,0,0,0,0,0,0,0,10,0,0,0,0,0,10,0,0,0,0,0]
[null,null,"TPCC Batting First",null,null,7,{"$nulls":7},41154,"Medmenham","Cancelled (Turville)","Home",0,0,0,0,0,0,0,0,0,0,11,0,0,0,0,0,11,0,0,0,0,0]
[{"$nulls":5},8]
[null,null,"TPCC Team Score",{"$f":"SUM(H7:H17)+H19","v":0},null,9]
[null,null,"TPCC Team Wickets",{"$f":"SUM(I7:I17)","v":0},null,10]
[{"$nulls":5},11]
[null,null,"Opposition Team Score",{"$f":"SUM(K24:K34)+H36","v":0}]
[null,null,"Opposition Team Wickets",{"$f":"SUM(J24:J34)","v":0},null,"Batting Extras"]
[]
[null,null,"TPCC Overs Bowled",{"$f":"SUM(H24:H34)","v":0}]
[null,null,"Opposition Overs Bowled",null,null,"Bowling"]
[{"$nulls":5},"Position","Name","Overs","Maidens","Wickets","Runs"]
[null,null,"TPCC Captain",null,null,1]
[{"$nulls":5},2]
[{"$nulls":5},3]
[{"$nulls":5},4]
[{"$nulls":5},5]
[{"$nulls":5},6]
[{"$nulls":5},7]
[{"$nulls":5},8]
[{"$nulls":5},9]
[{"$nulls":5},10]
[{"$nulls":5},11]
[]
[{"$nulls":5},"Bowling Extras"]

{"sheet":"Wylde Oats","index":33,"n_rows":36,"n_cols":39,"rows_kept":36,"merged":[[2,2,2,10],[4,5,4,8],[21,5,21,10]]}
[]
[{"$nulls":13},"Date","Opposition","Match Status","Home/Away","Captain","TPCC Batting First","TPCC Team Score","TPCC Team Wickets","Opposition Team Score","Opposition Team Wickets","TPCC Overs Bowled","TPCC Overs Faced","Batting Extras","Bowling Extras","Batsmen Position","Batsmen Name","Batsmen Runs","Batsmen Out",50,100,"Bowler Position","Bowler Name","Bowler Overs","Bowler Maidens","Bowler Wickets","Bowler Runs"]
[null,null,"Match Overview",{"$nulls":10},{"$f":"$D$5","v":41160},{"$f":"$D$7","v":"Wylde Oats"},{"$f":"$D$9","v":"Draw"},{"$f":"$D$11","v":"Home"},{"$f":"$D$24","v":"J. Hancock"},{"$f":"$D$13","v":"First"},{"$f":"$D$15","v":245},{"$f":"$D$16","v":4},{"$f":"$D$18","v":113},{"$f":"$D$19","v":6},{"$f":"$D$21","v":39},{"$f":"$D$22","v":36},{"$f":"$H$19","v":25},{"$f":"$H$36","v":4},{"$f":"F7","v":1},{"$f":"G7","v":"A. Bignell"},{"$f":"H7","v":0},{"$f":"I7","v":1},{"$f":"(IF(AD3>49,1,0))-AG3","v":0},{"$f":"IF(AD3>99,1,0)","v":0},{"$f":"F24","v":1},{"$f":"G24","v":"O. Thornton"},9,2,2,28]
[{"$nulls":13},41160,"Wylde Oats","Draw","Home",{"$f":"$D$24","v":"J. Hancock"},"First",245,4,113,6,39,36,25,4,{"$f":"F8","v":2},"Ro. Dickie",9,1,{"$f":"(IF(AD4>49,1,0))-AG4","v":0},{"$f":"IF(AD4>99,1,0)","v":0},{"$f":"F25","v":2},"N. Henry",7,1,2,14]
[null,null,"Date","2012-09-08",null,"Batting ",{"$nulls":7},41160,"Wylde Oats","Draw","Home","J. Hancock","First",245,4,113,6,39,36,25,4,3,"P. Briffett",72,1,1,0,3,"N. Runkel",11,2,2,35]
[{"$nulls":5},"Position","Name","Runs","Out",{"$nulls":4},41160,"Wylde Oats","Draw","Home","J. Hancock","First",245,4,113,6,39,36,25,4,4,"O. Thornton",51,1,1,0,4,"J. Thornton",3,0,0,4]
[null,null,"Opposition","Wylde Oats",null,1,"A. Bignell",0,1,{"$nulls":4},41160,"Wylde Oats","Draw","Home","J. Hancock","First",245,4,113,6,39,36,25,4,5,"C. Beardall",80,0,1,0,5,"O. Brett",2,0,0,9]
[{"$nulls":5},2,"Ro. Dickie",9,1,{"$nulls":4},41160,"Wylde Oats","Draw","Home","J. Hancock","First",245,4,113,6,39,36,25,4,6,"J. Thornton",8,0,0,0,6,"A. Bignell",4,0,0,14]
[null,null,"Match Status","Draw",null,3,"P. Briffett",72,1,{"$nulls":4},41160,"Wylde Oats","Draw","Home","J. Hancock","First",245,4,113,6,39,36,25,4,7,0,0,0,0,0,7,"J. Hancock",3,1,0,5]
[{"$nulls":5},4,"O. Thornton",51,1,{"$nulls":4},41160,"Wylde Oats","Draw","Home","J. Hancock","First",245,4,113,6,39,36,25,4,8,0,0,0,0,0,8,0,0,0,0,0]
[null,null,"Home / Away","Home",null,5,"C. Beardall",80,0,{"$nulls":4},41160,"Wylde Oats","Draw","Home","J. Hancock","First",245,4,113,6,39,36,25,4,9,0,0,0,0,0,9,0,0,0,0,0]
[{"$nulls":5},6,"J. Thornton",8,0,{"$nulls":4},41160,"Wylde Oats","Draw","Home","J. Hancock","First",245,4,113,6,39,36,25,4,10,0,0,0,0,0,10,0,0,0,0,0]
[null,null,"TPCC Batting First","First",null,7,{"$nulls":7},41160,"Wylde Oats","Draw","Home","J. Hancock","First",245,4,113,6,39,36,25,4,11,0,0,0,0,0,11,0,0,0,0,0]
[{"$nulls":5},8]
[null,null,"TPCC Team Score",{"$f":"SUM(H7:H17)+H19","v":245},null,9]
[null,null,"TPCC Team Wickets",{"$f":"SUM(I7:I17)","v":4},null,10]
[{"$nulls":5},11]
[null,null,"Opposition Team Score",{"$f":"SUM(K24:K34)+H36","v":113}]
[null,null,"Opposition Team Wickets",{"$f":"SUM(J24:J34)","v":6},null,"Batting Extras",null,25]
[]
[null,null,"TPCC Overs Bowled",{"$f":"SUM(H24:H34)","v":39}]
[null,null,"Opposition Overs Bowled",36,null,"Bowling"]
[{"$nulls":5},"Position","Name","Overs","Maidens","Wickets","Runs"]
[null,null,"TPCC Captain","J. Hancock",null,1,"O. Thornton",9,2,2,28]
[{"$nulls":5},2,"N. Henry",7,1,2,14]
[{"$nulls":5},3,"N. Runkel",11,2,2,35]
[{"$nulls":5},4,"J. Thornton",3,0,0,4]
[{"$nulls":5},5,"O. Brett",2,0,0,9]
[{"$nulls":5},6,"A. Bignell",4,0,0,14]
[{"$nulls":5},7,"J. Hancock",3,1,0,5]
[{"$nulls":5},8]
[{"$nulls":5},9]
[{"$nulls":5},10]
[{"$nulls":5},11]
[]
[{"$nulls":5},"Bowling Extras",null,4]

{"sheet":"Middleton Stoney","index":34,"n_rows":36,"n_cols":39,"rows_kept":36,"merged":[[2,2,2,10],[4,5,4,8],[21,5,21,10]]}
[]
[{"$nulls":13},"Date","Opposition","Match Status","Home/Away","Captain","TPCC Batting First","TPCC Team Score","TPCC Team Wickets","Opposition Team Score","Opposition Team Wickets","TPCC Overs Bowled","TPCC Overs Faced","Batting Extras","Bowling Extras","Batsmen Position","Batsmen Name","Batsmen Runs","Batsmen Out",50,100,"Bowler Position","Bowler Name","Bowler Overs","Bowler Maidens","Bowler Wickets","Bowler Runs"]
[null,null,"Match Overview",{"$nulls":10},{"$f":"$D$5","v":41161},{"$f":"$D$7","v":"Middleton Stoney"},{"$f":"$D$9","v":"Draw"},{"$f":"$D$11","v":"Home"},{"$f":"$D$24","v":"J. Hunt"},{"$f":"$D$13","v":"First"},{"$f":"$D$15","v":210},{"$f":"$D$16","v":8},{"$f":"$D$18","v":131},{"$f":"$D$19","v":8},{"$f":"$D$21","v":38},{"$f":"$D$22","v":41},{"$f":"$H$19","v":23},{"$f":"$H$36","v":3},{"$f":"F7","v":1},{"$f":"G7","v":"O. Thornton"},{"$f":"H7","v":72},{"$f":"I7","v":1},{"$f":"(IF(AD3>49,1,0))-AG3","v":1},{"$f":"IF(AD3>99,1,0)","v":0},{"$f":"F24","v":1},{"$f":"G24","v":"J. Leefe"},8,2,1,27]
[{"$nulls":13},41161,"Middleton Stoney","Draw","Home",{"$f":"$D$24","v":"J. Hunt"},"First",210,8,131,8,38,41,23,3,{"$f":"F8","v":2},"J. Moberly",8,1,{"$f":"(IF(AD4>49,1,0))-AG4","v":0},{"$f":"IF(AD4>99,1,0)","v":0},{"$f":"F25","v":2},"T. White",11,3,1,38]
[null,null,"Date","2012-09-09",null,"Batting ",{"$nulls":7},41161,"Middleton Stoney","Draw","Home","J. Hunt","First",210,8,131,8,38,41,23,3,3,"S. Bucknill",47,1,0,0,3,"B. Bucknill",5,1,3,20]
[{"$nulls":5},"Position","Name","Runs","Out",{"$nulls":4},41161,"Middleton Stoney","Draw","Home","J. Hunt","First",210,8,131,8,38,41,23,3,4,"T. Wade",10,1,0,0,4,"N. Henry",3,0,1,19]
[null,null,"Opposition","Middleton Stoney",null,1,"O. Thornton",72,1,{"$nulls":4},41161,"Middleton Stoney","Draw","Home","J. Hunt","First",210,8,131,8,38,41,23,3,5,"J. Hunt",41,0,0,0,5,"O. Thornton",4,4,0,0]
[{"$nulls":5},2,"J. Moberly",8,1,{"$nulls":4},41161,"Middleton Stoney","Draw","Home","J. Hunt","First",210,8,131,8,38,41,23,3,6,"C. Beardall",1,1,0,0,6,"C. Beardall",3,2,0,2]
[null,null,"Match Status","Draw",null,3,"S. Bucknill",47,1,{"$nulls":4},41161,"Middleton Stoney","Draw","Home","J. Hunt","First",210,8,131,8,38,41,23,3,7,"N. Henry",0,1,0,0,7,"J. Hunt",3,0,1,15]
[{"$nulls":5},4,"T. Wade",10,1,{"$nulls":4},41161,"Middleton Stoney","Draw","Home","J. Hunt","First",210,8,131,8,38,41,23,3,8,"J. Leefe",6,1,0,0,8,"J. Moberly",1,0,1,7]
[null,null,"Home / Away","Home",null,5,"J. Hunt",41,0,{"$nulls":4},41161,"Middleton Stoney","Draw","Home","J. Hunt","First",210,8,131,8,38,41,23,3,9,"B. Bucknill",1,1,0,0,9,0,0,0,0,0]
[{"$nulls":5},6,"C. Beardall",1,1,{"$nulls":4},41161,"Middleton Stoney","Draw","Home","J. Hunt","First",210,8,131,8,38,41,23,3,10,"T. White",1,0,0,0,10,0,0,0,0,0]
[null,null,"TPCC Batting First","First",null,7,"N. Henry",0,1,{"$nulls":4},41161,"Middleton Stoney","Draw","Home","J. Hunt","First",210,8,131,8,38,41,23,3,11,0,0,0,0,0,11,0,0,0,0,0]
[{"$nulls":5},8,"J. Leefe",6,1]
[null,null,"TPCC Team Score",{"$f":"SUM(H7:H17)+H19","v":210},null,9,"B. Bucknill",1,1]
[null,null,"TPCC Team Wickets",{"$f":"SUM(I7:I17)","v":8},null,10,"T. White",1,0]
[{"$nulls":5},11]
[null,null,"Opposition Team Score",{"$f":"SUM(K24:K34)+H36","v":131}]
[null,null,"Opposition Team Wickets",{"$f":"SUM(J24:J34)","v":8},null,"Batting Extras",null,23]
[]
[null,null,"TPCC Overs Bowled",{"$f":"SUM(H24:H34)","v":38}]
[null,null,"Opposition Overs Bowled",41,null,"Bowling"]
[{"$nulls":5},"Position","Name","Overs","Maidens","Wickets","Runs"]
[null,null,"TPCC Captain","J. Hunt",null,1,"J. Leefe",8,2,1,27]
[{"$nulls":5},2,"T. White",11,3,1,38]
[{"$nulls":5},3,"B. Bucknill",5,1,3,20]
[{"$nulls":5},4,"N. Henry",3,0,1,19]
[{"$nulls":5},5,"O. Thornton",4,4,0,0]
[{"$nulls":5},6,"C. Beardall",3,2,0,2]
[{"$nulls":5},7,"J. Hunt",3,0,1,15]
[{"$nulls":5},8,"J. Moberly",1,0,1,7]
[{"$nulls":5},9]
[{"$nulls":5},10]
[{"$nulls":5},11]
[]
[{"$nulls":5},"Bowling Extras",null,3]

{"sheet":"Harpsden (2)","index":35,"n_rows":36,"n_cols":39,"rows_kept":36,"merged":[[2,2,2,10],[4,5,4,8],[21,5,21,10]]}
[]
[{"$nulls":13},"Date","Opposition","Match Status","Home/Away","Captain","TPCC Batting First","TPCC Team Score","TPCC Team Wickets","Opposition Team Score","Opposition Team Wickets","TPCC Overs Bowled","TPCC Overs Faced","Batting Extras","Bowling Extras","Batsmen Position","Batsmen Name","Batsmen Runs","Batsmen Out",50,100,"Bowler Position","Bowler Name","Bowler Overs","Bowler Maidens","Bowler Wickets","Bowler Runs"]
[null,null,"Match Overview",{"$nulls":10},{"$f":"$D$5","v":41167},{"$f":"$D$7","v":"Harpsden (2)"},{"$f":"$D$9","v":"Win"},{"$f":"$D$11","v":"Home"},{"$f":"$D$24","v":"J. Hunt"},{"$f":"$D$13","v":"Second"},{"$f":"$D$15","v":135},{"$f":"$D$16","v":6},{"$f":"$D$18","v":133},{"$f":"$D$19","v":10},{"$f":"$D$21","v":40},{"$f":"$D$22","v":33},{"$f":"$H$19","v":5},{"$f":"$H$36","v":6},{"$f":"F7","v":1},{"$f":"G7","v":"J. Leefe"},{"$f":"H7","v":0},{"$f":"I7","v":1},{"$f":"(IF(AD3>49,1,0))-AG3","v":0},{"$f":"IF(AD3>99,1,0)","v":0},{"$f":"F24","v":1},{"$f":"G24","v":"T. White"},6,0,2,27]
[{"$nulls":13},41167,"Harpsden (2)","Win","Home",{"$f":"$D$24","v":"J. Hunt"},"Second",135,6,133,10,40,33,5,6,{"$f":"F8","v":2},"J. Moberly",2,1,{"$f":"(IF(AD4>49,1,0))-AG4","v":0},{"$f":"IF(AD4>99,1,0)","v":0},{"$f":"F25","v":2},"P. Girdler",7,2,1,28]
[null,null,"Date","2012-09-15",null,"Batting ",{"$nulls":7},41167,"Harpsden (2)","Win","Home","J. Hunt","Second",135,6,133,10,40,33,5,6,3,"C. Beardall",3,1,0,0,3,"J. Hunt",8,1,5,11]
[{"$nulls":5},"Position","Name","Runs","Out",{"$nulls":4},41167,"Harpsden (2)","Win","Home","J. Hunt","Second",135,6,133,10,40,33,5,6,4,"T. Wade",20,1,0,0,4,"J. Leefe",5,1,0,23]
[null,null,"Opposition","Harpsden (2)",null,1,"J. Leefe",0,1,{"$nulls":4},41167,"Harpsden (2)","Win","Home","J. Hunt","Second",135,6,133,10,40,33,5,6,5,"S. Halfhead",28,0,0,0,5,"A. Bignell",7,3,2,16]
[{"$nulls":5},2,"J. Moberly",2,1,{"$nulls":4},41167,"Harpsden (2)","Win","Home","J. Hunt","Second",135,6,133,10,40,33,5,6,6,"J. Hunt",6,1,0,0,6,"J. Hancock",7,2,0,22]
[null,null,"Match Status","Win",null,3,"C. Beardall",3,1,{"$nulls":4},41167,"Harpsden (2)","Win","Home","J. Hunt","Second",135,6,133,10,40,33,5,6,7,"J. Hancock",52,1,1,0,7,0,0,0,0,0]
[{"$nulls":5},4,"T. Wade",20,1,{"$nulls":4},41167,"Harpsden (2)","Win","Home","J. Hunt","Second",135,6,133,10,40,33,5,6,8,"A. Bignell",19,0,0,0,8,0,0,0,0,0]
[null,null,"Home / Away","Home",null,5,"S. Halfhead",28,0,{"$nulls":4},41167,"Harpsden (2)","Win","Home","J. Hunt","Second",135,6,133,10,40,33,5,6,9,0,0,0,0,0,9,0,0,0,0,0]
[{"$nulls":5},6,"J. Hunt",6,1,{"$nulls":4},41167,"Harpsden (2)","Win","Home","J. Hunt","Second",135,6,133,10,40,33,5,6,10,0,0,0,0,0,10,0,0,0,0,0]
[null,null,"TPCC Batting First","Second",null,7,"J. Hancock",52,1,{"$nulls":4},41167,"Harpsden (2)","Win","Home","J. Hunt","Second",135,6,133,10,40,33,5,6,11,0,0,0,0,0,11,0,0,0,0,0]
[{"$nulls":5},8,"A. Bignell",19,0]
[null,null,"TPCC Team Score",{"$f":"SUM(H7:H17)+H19","v":135},null,9]
[null,null,"TPCC Team Wickets",{"$f":"SUM(I7:I17)","v":6},null,10]
[{"$nulls":5},11]
[null,null,"Opposition Team Score",{"$f":"SUM(K24:K34)+H36","v":133}]
[null,null,"Opposition Team Wickets",{"$f":"SUM(J24:J34)","v":10},null,"Batting Extras",null,5]
[]
[null,null,"TPCC Overs Bowled",{"$f":"SUM(H24:H34)","v":40}]
[null,null,"Opposition Overs Bowled",33,null,"Bowling"]
[{"$nulls":5},"Position","Name","Overs","Maidens","Wickets","Runs"]
[null,null,"TPCC Captain","J. Hunt",null,1,"T. White",6,0,2,27]
[{"$nulls":5},2,"P. Girdler",7,2,1,28]
[{"$nulls":5},3,"J. Hunt",8,1,5,11]
[{"$nulls":5},4,"J. Leefe",5,1,0,23]
[{"$nulls":5},5,"A. Bignell",7,3,2,16]
[{"$nulls":5},6,"J. Hancock",7,2,0,22]
[{"$nulls":5},7]
[{"$nulls":5},8]
[{"$nulls":5},9]
[{"$nulls":5},10]
[{"$nulls":5},11]
[]
[{"$nulls":5},"Bowling Extras",null,6]

{"sheet":"Checkendon (2)","index":36,"n_rows":36,"n_cols":39,"rows_kept":36,"merged":[[2,2,2,10],[4,5,4,8],[21,5,21,10]]}
[]
[{"$nulls":13},"Date","Opposition","Match Status","Home/Away","Captain","TPCC Batting First","TPCC Team Score","TPCC Team Wickets","Opposition Team Score","Opposition Team Wickets","TPCC Overs Bowled","TPCC Overs Faced","Batting Extras","Bowling Extras","Batsmen Position","Batsmen Name","Batsmen Runs","Batsmen Out",50,100,"Bowler Position","Bowler Name","Bowler Overs","Bowler Maidens","Bowler Wickets","Bowler Runs"]
[null,null,"Match Overview",{"$nulls":10},{"$f":"$D$5","v":41174},{"$f":"$D$7","v":"Checkendon (2)"},{"$f":"$D$9","v":"Loss"},{"$f":"$D$11","v":"Away"},{"$f":"$D$24","v":"J. Hancock"},{"$f":"$D$13","v":"Second"},{"$f":"$D$15","v":89},{"$f":"$D$16","v":10},{"$f":"$D$18","v":174},{"$f":"$D$19","v":10},{"$f":"$D$21","v":46},{"$f":"$D$22","v":28},{"$f":"$H$19","v":11},{"$f":"$H$36","v":12},{"$f":"F7","v":1},{"$f":"G7","v":"P. Briffett"},{"$f":"H7","v":0},{"$f":"I7","v":1},{"$f":"(IF(AD3>49,1,0))-AG3","v":0},{"$f":"IF(AD3>99,1,0)","v":0},{"$f":"F24","v":1},{"$f":"G24","v":"K. Haig"},10,1,1,23]
[{"$nulls":13},41174,"Checkendon (2)","Loss","Away",{"$f":"$D$24","v":"J. Hancock"},"Second",89,10,174,10,46,28,11,12,{"$f":"F8","v":2},"J. Moberly",4,1,{"$f":"(IF(AD4>49,1,0))-AG4","v":0},{"$f":"IF(AD4>99,1,0)","v":0},{"$f":"F25","v":2},"J. Hunt",14,2,4,36]
[null,null,"Date","2012-09-22",null,"Batting ",{"$nulls":7},41174,"Checkendon (2)","Loss","Away","J. Hancock","Second",89,10,174,10,46,28,11,12,3,"R. Hunt",15,1,0,0,3,"C. Beardall",5,0,1,28]
[{"$nulls":5},"Position","Name","Runs","Out",{"$nulls":4},41174,"Checkendon (2)","Loss","Away","J. Hancock","Second",89,10,174,10,46,28,11,12,4,"C. Beardall",19,1,0,0,4,"J. Moberly",7,1,1,43]
[null,null,"Opposition","Checkendon (2)",null,1,"P. Briffett",0,1,{"$nulls":4},41174,"Checkendon (2)","Loss","Away","J. Hancock","Second",89,10,174,10,46,28,11,12,5,"T. Wade",12,1,0,0,5,"J. Hancock",6,1,2,16]
[{"$nulls":5},2,"J. Moberly",4,1,{"$nulls":4},41174,"Checkendon (2)","Loss","Away","J. Hancock","Second",89,10,174,10,46,28,11,12,6,"V. Haig",11,1,0,0,6,"P. Briffett",4,0,1,16]
[null,null,"Match Status","Loss",null,3,"R. Hunt",15,1,{"$nulls":4},41174,"Checkendon (2)","Loss","Away","J. Hancock","Second",89,10,174,10,46,28,11,12,7,"J. Hunt",3,1,0,0,7,0,0,0,0,0]
[{"$nulls":5},4,"C. Beardall",19,1,{"$nulls":4},41174,"Checkendon (2)","Loss","Away","J. Hancock","Second",89,10,174,10,46,28,11,12,8,"P. Sheriff",12,1,0,0,8,0,0,0,0,0]
[null,null,"Home / Away","Away",null,5,"T. Wade",12,1,{"$nulls":4},41174,"Checkendon (2)","Loss","Away","J. Hancock","Second",89,10,174,10,46,28,11,12,9,"J. Hancock",1,1,0,0,9,0,0,0,0,0]
[{"$nulls":5},6,"V. Haig",11,1,{"$nulls":4},41174,"Checkendon (2)","Loss","Away","J. Hancock","Second",89,10,174,10,46,28,11,12,10,"C. Wellbelove",0,1,0,0,10,0,0,0,0,0]
[null,null,"TPCC Batting First","Second",null,7,"J. Hunt",3,1,{"$nulls":4},41174,"Checkendon (2)","Loss","Away","J. Hancock","Second",89,10,174,10,46,28,11,12,11,"T. Greenwood",1,0,0,0,11,0,0,0,0,0]
[{"$nulls":5},8,"P. Sheriff",12,1]
[null,null,"TPCC Team Score",{"$f":"SUM(H7:H17)+H19","v":89},null,9,"J. Hancock",1,1]
[null,null,"TPCC Team Wickets",{"$f":"SUM(I7:I17)","v":10},null,10,"C. Wellbelove",0,1]
[{"$nulls":5},11,"T. Greenwood",1,0]
[null,null,"Opposition Team Score",{"$f":"SUM(K24:K34)+H36","v":174}]
[null,null,"Opposition Team Wickets",{"$f":"SUM(J24:J34)","v":10},null,"Batting Extras",null,11]
[]
[null,null,"TPCC Overs Bowled",{"$f":"SUM(H24:H34)","v":46}]
[null,null,"Opposition Overs Bowled",28,null,"Bowling"]
[{"$nulls":5},"Position","Name","Overs","Maidens","Wickets","Runs"]
[null,null,"TPCC Captain","J. Hancock",null,1,"K. Haig",10,1,1,23]
[{"$nulls":5},2,"J. Hunt",14,2,4,36]
[{"$nulls":5},3,"C. Beardall",5,0,1,28]
[{"$nulls":5},4,"J. Moberly",7,1,1,43]
[{"$nulls":5},5,"J. Hancock",6,1,2,16]
[{"$nulls":5},6,"P. Briffett",4,0,1,16]
[{"$nulls":5},7]
[{"$nulls":5},8]
[{"$nulls":5},9]
[{"$nulls":5},10]
[{"$nulls":5},11]
[]
[{"$nulls":5},"Bowling Extras",null,12]

{"sheet":"Greys Green (2)","index":37,"n_rows":36,"n_cols":39,"rows_kept":36,"merged":[[2,2,2,10],[4,5,4,8],[21,5,21,10]]}
[]
[{"$nulls":13},"Date","Opposition","Match Status","Home/Away","Captain","TPCC Batting First","TPCC Team Score","TPCC Team Wickets","Opposition Team Score","Opposition Team Wickets","TPCC Overs Bowled","TPCC Overs Faced","Batting Extras","Bowling Extras","Batsmen Position","Batsmen Name","Batsmen Runs","Batsmen Out",50,100,"Bowler Position","Bowler Name","Bowler Overs","Bowler Maidens","Bowler Wickets","Bowler Runs"]
[null,null,"Match Overview",{"$nulls":10},{"$f":"$D$5","v":41181},{"$f":"$D$7","v":"Greys Green (2)"},{"$f":"$D$9","v":"Win"},{"$f":"$D$11","v":"Away"},{"$f":"$D$24","v":"S. Beardall"},{"$f":"$D$13","v":"Second"},{"$f":"$D$15","v":190},{"$f":"$D$16","v":6},{"$f":"$D$18","v":185},{"$f":"$D$19","v":7},{"$f":"$D$21","v":50},{"$f":"$D$22","v":37},{"$f":"$H$19","v":4},{"$f":"$H$36","v":13},{"$f":"F7","v":1},{"$f":"G7","v":"J. Moberly"},{"$f":"H7","v":27},{"$f":"I7","v":1},{"$f":"(IF(AD3>49,1,0))-AG3","v":0},{"$f":"IF(AD3>99,1,0)","v":0},{"$f":"F24","v":1},{"$f":"G24","v":"T. White"},10,2,0,28]
[{"$nulls":13},41181,"Greys Green (2)","Win","Away",{"$f":"$D$24","v":"S. Beardall"},"Second",190,6,185,7,50,37,4,13,{"$f":"F8","v":2},"P. Briffett",5,1,{"$f":"(IF(AD4>49,1,0))-AG4","v":0},{"$f":"IF(AD4>99,1,0)","v":0},{"$f":"F25","v":2},"A. Bignell",11,5,0,23]
[null,null,"Date","2012-09-29",null,"Batting ",{"$nulls":7},41181,"Greys Green (2)","Win","Away","S. Beardall","Second",190,6,185,7,50,37,4,13,3,"C. Beardall",20,1,0,0,3,"J. Hunt",6,2,0,9]
[{"$nulls":5},"Position","Name","Runs","Out",{"$nulls":4},41181,"Greys Green (2)","Win","Away","S. Beardall","Second",190,6,185,7,50,37,4,13,4,"J. Hunt",27,1,0,0,4,"S. Beardall",7,1,1,24]
[null,null,"Opposition","Greys Green (2)",null,1,"J. Moberly",27,1,{"$nulls":4},41181,"Greys Green (2)","Win","Away","S. Beardall","Second",190,6,185,7,50,37,4,13,5,"T. Wade",1,1,0,0,5,"N. Runkel",10,1,2,45]
[{"$nulls":5},2,"P. Briffett",5,1,{"$nulls":4},41181,"Greys Green (2)","Win","Away","S. Beardall","Second",190,6,185,7,50,37,4,13,6,"S. Beardall",74,0,1,0,6,"Ro. Dickie",2,0,0,29]
[null,null,"Match Status","Win",null,3,"C. Beardall",20,1,{"$nulls":4},41181,"Greys Green (2)","Win","Away","S. Beardall","Second",190,6,185,7,50,37,4,13,7,"Ro. Dickie",0,1,0,0,7,"C. Beardall",4,0,3,14]
[{"$nulls":5},4,"J. Hunt",27,1,{"$nulls":4},41181,"Greys Green (2)","Win","Away","S. Beardall","Second",190,6,185,7,50,37,4,13,8,"A. Bignell",32,0,0,0,8,"Run Out",0,0,1,0]
[null,null,"Home / Away","Away",null,5,"T. Wade",1,1,{"$nulls":4},41181,"Greys Green (2)","Win","Away","S. Beardall","Second",190,6,185,7,50,37,4,13,9,0,0,0,0,0,9,0,0,0,0,0]
[{"$nulls":5},6,"S. Beardall",74,0,{"$nulls":4},41181,"Greys Green (2)","Win","Away","S. Beardall","Second",190,6,185,7,50,37,4,13,10,0,0,0,0,0,10,0,0,0,0,0]
[null,null,"TPCC Batting First","Second",null,7,"Ro. Dickie",0,1,{"$nulls":4},41181,"Greys Green (2)","Win","Away","S. Beardall","Second",190,6,185,7,50,37,4,13,11,0,0,0,0,0,11,0,0,0,0,0]
[{"$nulls":5},8,"A. Bignell",32,0]
[null,null,"TPCC Team Score",{"$f":"SUM(H7:H17)+H19","v":190},null,9]
[null,null,"TPCC Team Wickets",{"$f":"SUM(I7:I17)","v":6},null,10]
[{"$nulls":5},11]
[null,null,"Opposition Team Score",{"$f":"SUM(K24:K34)+H36","v":185}]
[null,null,"Opposition Team Wickets",{"$f":"SUM(J24:J34)","v":7},null,"Batting Extras",null,4]
[]
[null,null,"TPCC Overs Bowled",{"$f":"SUM(H24:H34)","v":50}]
[null,null,"Opposition Overs Bowled",37,null,"Bowling"]
[{"$nulls":5},"Position","Name","Overs","Maidens","Wickets","Runs"]
[null,null,"TPCC Captain","S. Beardall",null,1,"T. White",10,2,0,28]
[{"$nulls":5},2,"A. Bignell",11,5,0,23]
[{"$nulls":5},3,"J. Hunt",6,2,0,9]
[{"$nulls":5},4,"S. Beardall",7,1,1,24]
[{"$nulls":5},5,"N. Runkel",10,1,2,45]
[{"$nulls":5},6,"Ro. Dickie",2,0,0,29]
[{"$nulls":5},7,"C. Beardall",4,0,3,14]
[{"$nulls":5},8,"Run Out",0,0,1,0]
[{"$nulls":5},9]
[{"$nulls":5},10]
[{"$nulls":5},11]
[]
[{"$nulls":5},"Bowling Extras",null,13]

{"sheet":"Historic Results","index":38,"n_rows":16,"n_cols":4,"rows_kept":16,"merged":[[2,0,5,0],[7,0,10,0],[12,0,15,0]]}
[]
[]
[2011,2011,"Win",7]
[null,2011,"Draw",7]
[null,2011,"Loss",10]
[null,2011,"Abandoned",9]
[]
[2010,2010,"Win",11]
[null,2010,"Draw",6]
[null,2010,"Loss",8]
[null,2010,"Abandoned",13]
[]
[2009,2009,"Win",9]
[null,2009,"Draw",6]
[null,2009,"Loss",14]
[null,2009,"Abandoned",6]